program: Orca
programVersion: 5.0.2
elementType: O O N N C C C C C C C C C H H H H H H H H H H H H H H H H H H H H
charge: 0
multiplicity: 1
keywords: wb97x-d3
keywords: def2-TZVPP
keywords: def2/J RIJCOSX
keywords: DEFGRID2
keywords: scfconv7
keywords: smallprint printgap noloewdin
keywords: NOSOSCF
formula: C9H20N2O2
InChI: InChI=1/C9H20N2O2/c1-4-8-13-9(12)10-6-5-7-11(2)3/h10H,4-8H2,1-3H3
33 atoms
O  -2.467959 0.881743 -0.94327
O  -1.308346 0.912919 0.995374
N  3.955743 -1.126988 0.056139
N  -0.288049 1.228865 -1.008765
C  1.745049 -0.066491 -0.40328
C  3.143831 0.069904 0.182092
C  1.062515 1.293785 -0.499057
C  3.416446 -2.240687 0.80621
C  5.319042 -0.859403 0.457498
C  -3.699916 0.647329 -0.255909
C  -3.911325 -0.811081 0.10401
C  -1.348302 0.99145 -0.218057
C  -5.295876 -1.019939 0.701245
H  1.808528 -0.512437 -1.400109
H  1.128502 -0.729551 0.208984
H  3.063321 0.396295 1.234905
H  3.663908 0.876305 -0.34498
H  1.048732 1.781891 0.476654
H  1.630866 1.947858 -1.162261
H  -0.415127 1.184597 -2.008329
H  3.307918 -2.031533 1.883079
H  4.072091 -3.107111 0.704628
H  2.437985 -2.535643 0.426119
H  5.420009 -0.569917 1.515831
H  5.739488 -0.052501 -0.145669
H  5.939095 -1.743629 0.298942
H  -4.470017 0.974536 -0.956545
H  -3.772549 1.283769 0.629729
H  -3.796618 -1.427298 -0.791608
H  -3.150955 -1.13809 0.816206
H  -5.447504 -2.061883 0.984298
H  -5.44105 -0.41351 1.597538
H  -6.08249 -0.754572 -0.007916
elementType: O N C H
totalener: -615.06275674 hartree
nucrepener: 825.94056806 hartree
electener: -1441.00332480 hartree
oneelecener: -2473.73479054 hartree
twoeener: 1032.73146574 hartree
cpcmener: -0.02139784 hartree
kineticenergy: 612.18770716 hartree
xcener: -59.905281523103 hartree
chargesum: -0.0000000
charge: -0.336906 -0.544821 -0.232186 -0.240696 -0.069862 -0.112176 -0.044597 -0.194934 -0.188677 0.032660 -0.093156 0.514125 -0.273497 0.062072 0.073333 0.070235 0.081616 0.091457 0.103262 0.172091 0.077332 0.098896 0.098766 0.074498 0.097186 0.098140 0.106553 0.090065 0.062382 0.067393 0.092999 0.084211 0.082236
qa: -0.3369 -0.5448 -0.2322 -0.2407 -0.0699 -0.1122 -0.0446 -0.1949 -0.1887 0.0327 -0.0932 0.5141 -0.2735 0.0621 0.0733 0.0702 0.0816 0.0915 0.1033 0.1721 0.0773 0.0989 0.0988 0.0745 0.0972 0.0981 0.1066 0.0901 0.0624 0.0674 0.0930 0.0842 0.0822
va: 2.0756 1.9555 2.9051 3.1939 3.7866 3.9444 3.8864 3.9322 3.9331 3.8548 3.8589 4.3041 3.9460 1.0302 1.0235 1.0077 1.0004 1.0181 1.0037 1.0181 1.0028 0.9953 0.9938 1.0025 0.9959 0.9951 0.9994 1.0143 1.0121 1.0240 1.0027 1.0009 1.0017
dispcorr: -0.010988537 hartree
energy: -615.073745273780
dipole: 5.94798 -5.82528 0.12270 -7.81942 7.81035 -0.00907 3.51167 -4.50657 -0.99490
magnitude: 1.00248 au
magnitude: 2.54809 debye
