program: Orca
programVersion: 5.0.2
elementType: O O N N C C C C C C C C C H H H H H H H H H H H H H H H H H H H H
charge: 0
multiplicity: 1
keywords: wb97x-d3
keywords: def2-TZVPP
keywords: def2/J RIJCOSX
keywords: DEFGRID2
keywords: scfconv7
keywords: smallprint printgap noloewdin
keywords: NOSOSCF
formula: C9H20N2O2
InChI: InChI=1/C9H20N2O2/c1-4-8-13-9(12)10-6-5-7-11(2)3/h10H,4-8H2,1-3H3
33 atoms
O  -2.435119 0.922906 -0.90713
O  -1.582891 0.758138 1.178026
N  4.110528 -0.94808 -0.074695
N  -0.279102 1.271275 -0.614358
C  1.826383 0.022855 -0.288569
C  3.176468 0.050813 0.413598
C  1.001643 1.258419 0.052971
C  5.426143 -0.730289 0.485429
C  3.666811 -2.297838 0.198422
C  -3.75618 0.648492 -0.43476
C  -4.017692 -0.831817 -0.231514
C  -1.438592 0.959125 -0.012606
C  -5.461015 -1.069391 0.187877
H  1.984946 -0.018798 -1.370274
H  1.255196 -0.866617 -0.011946
H  3.021558 -0.035759 1.503707
H  3.631707 1.032326 0.249274
H  0.835897 1.323181 1.127735
H  1.548255 2.159943 -0.232731
H  -0.279121 1.377184 -1.617152
H  6.137402 -1.443164 0.064819
H  5.461452 -0.835489 1.581413
H  5.781574 0.271795 0.238871
H  2.716002 -2.507744 -0.291481
H  3.542834 -2.507254 1.273451
H  4.392331 -3.012264 -0.194341
H  -4.412413 1.039874 -1.213391
H  -3.961601 1.211622 0.478779
H  -3.807879 -1.368606 -1.160307
H  -3.345009 -1.23334 0.529032
H  -5.655467 -2.132057 0.333284
H  -5.693203 -0.563199 1.126806
H  -6.16367 -0.707521 -0.565164
elementType: O N C H
totalener: -615.06230893 hartree
nucrepener: 821.17582544 hartree
electener: -1436.23813437 hartree
oneelecener: -2464.10123912 hartree
twoeener: 1027.86310475 hartree
cpcmener: -0.02129422 hartree
kineticenergy: 612.20207896 hartree
xcener: -59.908193704216 hartree
chargesum: -0.0000000
charge: -0.338563 -0.543050 -0.233147 -0.233905 -0.063502 -0.112364 -0.041166 -0.190838 -0.194784 0.030466 -0.094239 0.509616 -0.272762 0.062447 0.071678 0.070710 0.081560 0.088652 0.101544 0.168569 0.098933 0.074725 0.097072 0.100298 0.076095 0.099320 0.108749 0.089058 0.062604 0.067595 0.092865 0.084377 0.081385
qa: -0.3386 -0.5430 -0.2331 -0.2339 -0.0635 -0.1124 -0.0412 -0.1908 -0.1948 0.0305 -0.0942 0.5096 -0.2728 0.0624 0.0717 0.0707 0.0816 0.0887 0.1015 0.1686 0.0989 0.0747 0.0971 0.1003 0.0761 0.0993 0.1087 0.0891 0.0626 0.0676 0.0929 0.0844 0.0814
va: 2.0710 1.9614 2.9060 3.1945 3.8122 3.9483 3.8768 3.9342 3.9302 3.8542 3.8598 4.3099 3.9478 1.0298 1.0175 1.0072 1.0009 1.0269 1.0017 1.0190 0.9946 1.0027 0.9963 0.9940 1.0036 0.9949 0.9995 1.0146 1.0119 1.0251 1.0025 1.0011 1.0018
dispcorr: -0.010809721 hartree
energy: -615.073118651964
dipole: 6.36829 -6.05064 0.31765 -8.10820 8.13600 0.02780 1.63613 -2.58777 -0.95164
magnitude: 1.00364 au
magnitude: 2.55105 debye
