program: Orca
programVersion: 5.0.2
elementType: O O N N C C C C C C C C C H H H H H H H H H H H H H H H H H H H H
charge: 0
multiplicity: 1
keywords: wb97x-d3
keywords: def2-TZVPP
keywords: def2/J RIJCOSX
keywords: DEFGRID2
keywords: scfconv7
keywords: smallprint printgap noloewdin
keywords: NOSOSCF
formula: C9H20N2O2
InChI: InChI=1/C9H20N2O2/c1-4-8-13-9(12)10-6-5-7-11(2)3/h10H,4-8H2,1-3H3
33 atoms
O  -2.031177 0.263551 0.457757
O  -1.199174 2.185817 -0.370204
N  2.891001 -1.106374 0.151003
N  0.110899 0.717216 0.763532
C  2.028424 1.034833 -0.789675
C  2.238243 -0.462572 -0.974294
C  1.363552 1.40129 0.531933
C  2.847053 -2.545517 0.022703
C  4.251366 -0.650552 0.329562
C  -3.349581 0.617366 0.030302
C  -4.238611 -0.593115 0.208345
C  -1.046972 1.137608 0.22922
C  -3.85611 -1.772419 -0.673881
H  2.974947 1.577255 -0.85924
H  1.417613 1.394664 -1.621983
H  2.789731 -0.629596 -1.91606
H  1.263243 -0.938602 -1.110959
H  2.021215 1.158976 1.365772
H  1.195447 2.477488 0.575706
H  0.146819 -0.205381 1.167483
H  3.389393 -2.927326 -0.856965
H  1.81302 -2.886522 -0.053933
H  3.283217 -3.016184 0.905787
H  4.896769 -0.853642 -0.540563
H  4.699935 -1.143783 1.193749
H  4.287184 0.422282 0.521587
H  -3.340665 0.930679 -1.0169
H  -3.717408 1.455604 0.628494
H  -4.251397 -0.891085 1.26046
H  -5.256412 -0.272453 -0.028383
H  -2.861463 -2.154372 -0.441998
H  -4.557944 -2.597077 -0.544991
H  -3.867139 -1.495622 -1.730071
elementType: O N C H
totalener: -615.06315970 hartree
nucrepener: 858.17101755 hartree
electener: -1473.23417725 hartree
oneelecener: -2538.08932315 hartree
twoeener: 1064.85514591 hartree
cpcmener: -0.01952792 hartree
kineticenergy: 612.20953304 hartree
xcener: -59.911166753662 hartree
chargesum: -0.0000000
charge: -0.331628 -0.543288 -0.242700 -0.237363 -0.117526 -0.105449 -0.066973 -0.190072 -0.189869 0.017216 -0.099061 0.519468 -0.255103 0.080484 0.084949 0.088403 0.092407 0.104502 0.099042 0.172596 0.074709 0.096909 0.098030 0.077987 0.099066 0.094105 0.092336 0.109396 0.063151 0.064962 0.080307 0.091117 0.077891
qa: -0.3316 -0.5433 -0.2427 -0.2374 -0.1175 -0.1054 -0.0670 -0.1901 -0.1899 0.0172 -0.0991 0.5195 -0.2551 0.0805 0.0849 0.0884 0.0924 0.1045 0.0990 0.1726 0.0747 0.0969 0.0980 0.0780 0.0991 0.0941 0.0923 0.1094 0.0632 0.0650 0.0803 0.0911 0.0779
va: 2.0622 1.9647 2.8701 3.1538 3.7854 3.8906 3.9168 3.9278 3.9377 3.8495 3.9417 4.3037 3.9152 1.0110 1.0218 1.0138 1.0055 1.0071 1.0197 1.0220 1.0020 0.9954 0.9962 1.0052 0.9964 0.9946 1.0035 1.0010 1.0134 1.0115 1.0104 1.0043 1.0031
dispcorr: -0.012201560 hartree
energy: -615.075361257113
dipole: 5.94442 -5.42258 0.52184 -10.00948 8.65455 -1.35493 -2.70922 3.00168 0.29246
magnitude: 1.48111 au
magnitude: 3.76468 debye
