program: Orca
programVersion: 5.0.2
elementType: O O N N C C C C C C C C C H H H H H H H H H H H H H H H H H H H H
charge: 0
multiplicity: 1
keywords: wb97x-d3
keywords: def2-TZVPP
keywords: def2/J RIJCOSX
keywords: DEFGRID2
keywords: scfconv7
keywords: smallprint printgap noloewdin
keywords: NOSOSCF
formula: C9H20N2O2
InChI: InChI=1/C9H20N2O2/c1-4-8-13-9(12)10-6-5-7-11(2)3/h10H,4-8H2,1-3H3
33 atoms
O  -1.959157 -0.184572 0.235086
O  -1.267303 1.960941 0.271394
N  3.268495 -0.910933 0.002366
N  0.108989 0.261287 0.885826
C  2.07804 1.264299 -0.254591
C  2.539189 -0.037203 -0.89831
C  1.300059 1.067421 1.040948
C  4.52739 -0.337548 0.423533
C  3.476208 -2.211945 -0.593026
C  -3.269452 0.228993 -0.163583
C  -4.07187 -1.010068 -0.497242
C  -1.049961 0.77654 0.4438
C  -5.498905 -0.646492 -0.878828
H  2.927077 1.921717 -0.050392
H  1.456312 1.797801 -0.978587
H  3.130436 0.204329 -1.799041
H  1.66163 -0.5841 -1.254991
H  1.926897 0.579664 1.786369
H  1.020989 2.03515 1.457256
H  0.20787 -0.741437 0.918119
H  5.04155 -1.024858 1.097434
H  4.375321 0.592218 0.972731
H  5.209696 -0.121227 -0.41455
H  2.518579 -2.665519 -0.855051
H  3.970115 -2.876332 0.11853
H  4.093125 -2.186567 -1.505496
H  -3.21248 0.887329 -1.034321
H  -3.74494 0.787296 0.648487
H  -3.592791 -1.543512 -1.322668
H  -4.081355 -1.688774 0.359634
H  -6.067885 -1.535084 -1.152647
H  -6.023819 -0.163256 -0.052815
H  -5.526714 0.034897 -1.731432
elementType: O N C H
totalener: -615.06337611 hartree
nucrepener: 843.49167232 hartree
electener: -1458.55504843 hartree
oneelecener: -2508.69372949 hartree
twoeener: 1050.13868106 hartree
cpcmener: -0.01973003 hartree
kineticenergy: 612.19844444 hartree
xcener: -59.908672952393 hartree
chargesum: 0.0000000
charge: -0.330543 -0.541119 -0.240880 -0.239042 -0.118109 -0.102534 -0.062349 -0.190840 -0.191040 0.036224 -0.084633 0.514129 -0.275614 0.079502 0.084940 0.086241 0.089844 0.105486 0.098986 0.173562 0.099575 0.094077 0.078248 0.096850 0.098000 0.074022 0.088528 0.093615 0.063470 0.063516 0.093245 0.082743 0.081897
qa: -0.3305 -0.5411 -0.2409 -0.2390 -0.1181 -0.1025 -0.0623 -0.1908 -0.1910 0.0362 -0.0846 0.5141 -0.2756 0.0795 0.0849 0.0862 0.0898 0.1055 0.0990 0.1736 0.0996 0.0941 0.0782 0.0969 0.0980 0.0740 0.0885 0.0936 0.0635 0.0635 0.0932 0.0827 0.0819
va: 2.0676 1.9651 2.8696 3.1640 3.8012 3.8871 3.9050 3.9375 3.9303 3.8501 3.9196 4.3074 3.9517 1.0111 1.0222 1.0139 1.0065 1.0101 1.0200 1.0191 0.9964 0.9938 1.0050 0.9954 0.9962 1.0014 1.0022 0.9974 1.0104 1.0102 1.0035 1.0017 1.0013
dispcorr: -0.011697394 hartree
energy: -615.075073506245
dipole: 4.79475 -4.15255 0.64219 -6.08822 4.77280 -1.31543 -4.40176 4.18954 -0.21223
magnitude: 1.47912 au
magnitude: 3.75963 debye
