program: Orca
programVersion: 5.0.2
elementType: O O N N C C C C C C C C C H H H H H H H H H H H H H H H H H H H H
charge: 0
multiplicity: 1
keywords: wb97x-d3
keywords: def2-TZVPP
keywords: def2/J RIJCOSX
keywords: DEFGRID2
keywords: scfconv7
keywords: smallprint printgap noloewdin
keywords: NOSOSCF
formula: C9H20N2O2
InChI: InChI=1/C9H20N2O2/c1-4-8-13-9(12)10-6-5-7-11(2)3/h10H,4-8H2,1-3H3
33 atoms
O  -1.774877 -0.115286 0.238013
O  -1.145475 2.021885 -0.105216
N  2.879307 -0.970085 0.064081
N  0.219607 0.528584 0.93293
C  2.198659 1.397876 -0.308428
C  2.430719 0.014509 -0.903494
C  1.391975 1.372284 0.986602
C  4.205951 -0.687149 0.564155
C  2.810225 -2.306204 -0.483511
C  -3.061415 0.140727 -0.328942
C  -3.877444 -1.128518 -0.211981
C  -0.911214 0.903098 0.312767
C  -5.279018 -0.933182 -0.769372
H  3.144052 1.909586 -0.109628
H  1.684135 2.002688 -1.059277
H  3.12886 0.103003 -1.754013
H  1.488925 -0.344392 -1.327397
H  2.008166 1.001658 1.804854
H  1.095435 2.384891 1.261744
H  0.36309 -0.454661 1.105205
H  4.484795 -1.423302 1.320165
H  4.246416 0.292798 1.040983
H  4.979843 -0.706643 -0.220135
H  3.473688 -2.463243 -1.348898
H  1.791272 -2.530641 -0.804155
H  3.083903 -3.039783 0.277138
H  -2.959047 0.43649 -1.37713
H  -3.553084 0.959166 0.204085
H  -3.376332 -1.939725 -0.746593
H  -3.937287 -1.427125 0.837918
H  -5.813221 -0.141417 -0.240997
H  -5.258349 -0.66897 -1.828063
H  -5.866895 -1.845854 -0.670698
elementType: O N C H
totalener: -615.06263164 hartree
nucrepener: 856.38127821 hartree
electener: -1471.44390985 hartree
oneelecener: -2534.49022328 hartree
twoeener: 1063.04631343 hartree
cpcmener: -0.01908614 hartree
kineticenergy: 612.20925049 hartree
xcener: -59.910975437835 hartree
chargesum: 0.0000000
charge: -0.327958 -0.540601 -0.250579 -0.232161 -0.123067 -0.104502 -0.071105 -0.190454 -0.187382 0.036223 -0.084132 0.509990 -0.275272 0.081495 0.085938 0.091337 0.096865 0.104360 0.102611 0.170073 0.099826 0.093602 0.078288 0.077223 0.095833 0.098159 0.094001 0.088095 0.063159 0.062988 0.081769 0.082415 0.092962
qa: -0.3280 -0.5406 -0.2506 -0.2322 -0.1231 -0.1045 -0.0711 -0.1905 -0.1874 0.0362 -0.0841 0.5100 -0.2753 0.0815 0.0859 0.0913 0.0969 0.1044 0.1026 0.1701 0.0998 0.0936 0.0783 0.0772 0.0958 0.0982 0.0940 0.0881 0.0632 0.0630 0.0818 0.0824 0.0930
va: 2.0656 1.9670 2.8624 3.1451 3.7610 3.8985 3.9232 3.9371 3.9200 3.8503 3.9238 4.3165 3.9524 1.0108 1.0210 1.0135 1.0007 1.0048 1.0156 1.0313 0.9962 0.9961 1.0048 1.0027 0.9965 0.9962 0.9982 1.0005 1.0101 1.0105 1.0014 1.0015 1.0036
dispcorr: -0.012211919 hartree
energy: -615.074843561230
dipole: 3.93944 -3.22774 0.71170 -7.54426 6.18397 -1.36029 -3.27355 3.32225 0.04870
magnitude: 1.53600 au
magnitude: 3.90419 debye
