program: Orca
programVersion: 5.0.2
elementType: O O N N C C C C C C C C C H H H H H H H H H H H H H H H H H H H H
charge: 0
multiplicity: 1
keywords: wb97x-d3
keywords: def2-TZVPP
keywords: def2/J RIJCOSX
keywords: DEFGRID2
keywords: scfconv7
keywords: smallprint printgap noloewdin
keywords: NOSOSCF
formula: C9H20N2O2
InChI: InChI=1/C9H20N2O2/c1-4-8-13-9(12)10-6-5-7-11(2)3/h10H,4-8H2,1-3H3
33 atoms
O  -1.898237 -0.16709 0.270341
O  -1.23275 1.984429 0.200455
N  3.143586 -0.933014 -0.003681
N  0.149383 0.340008 0.938103
C  2.0965 1.313301 -0.265474
C  2.478227 -0.013917 -0.908428
C  1.335125 1.161537 1.045954
C  4.431817 -0.439386 0.428344
C  3.272065 -2.24487 -0.596934
C  -3.202183 0.202514 -0.185491
C  -3.984225 -1.065147 -0.449992
C  -1.006102 0.814373 0.445174
C  -5.402642 -0.744488 -0.895528
H  2.980212 1.92967 -0.080376
H  1.489209 1.872103 -0.982467
H  3.089281 0.189644 -1.805447
H  1.569572 -0.502857 -1.270843
H  1.973137 0.706113 1.802241
H  1.055603 2.142993 1.429466
H  0.263663 -0.65871 1.014116
H  4.897129 -1.156609 1.106477
H  4.332422 0.498383 0.97605
H  5.133264 -0.265847 -0.403852
H  3.895337 -2.260839 -1.505523
H  2.289167 -2.636703 -0.865005
H  3.717591 -2.939074 0.118123
H  -3.130762 0.798786 -1.098174
H  -3.702063 0.810297 0.573746
H  -3.478292 -1.652143 -1.220267
H  -4.012644 -1.679447 0.453049
H  -5.411834 -0.132607 -1.798813
H  -5.958768 -1.655923 -1.113863
H  -5.951866 -0.202797 -0.124318
elementType: O N C H
totalener: -615.06327684 hartree
nucrepener: 847.91394147 hartree
electener: -1462.97721831 hartree
oneelecener: -2517.53557499 hartree
twoeener: 1054.55835667 hartree
cpcmener: -0.01952132 hartree
kineticenergy: 612.21278328 hartree
xcener: -59.911626209861 hartree
chargesum: -0.0000000
charge: -0.329647 -0.541091 -0.241520 -0.238170 -0.117732 -0.105050 -0.064461 -0.190531 -0.190525 0.036794 -0.084189 0.513224 -0.275385 0.079950 0.085083 0.087674 0.091681 0.104945 0.099744 0.172287 0.099422 0.093348 0.078690 0.074677 0.096635 0.098029 0.088075 0.093723 0.063553 0.063205 0.081909 0.092973 0.082681
qa: -0.3296 -0.5411 -0.2415 -0.2382 -0.1177 -0.1051 -0.0645 -0.1905 -0.1905 0.0368 -0.0842 0.5132 -0.2754 0.0799 0.0851 0.0877 0.0917 0.1049 0.0997 0.1723 0.0994 0.0933 0.0787 0.0747 0.0966 0.0980 0.0881 0.0937 0.0636 0.0632 0.0819 0.0930 0.0827
va: 2.0679 1.9656 2.8695 3.1581 3.7869 3.8913 3.9157 3.9377 3.9283 3.8495 3.9203 4.3110 3.9521 1.0113 1.0220 1.0139 1.0053 1.0075 1.0186 1.0222 0.9966 0.9943 1.0046 1.0017 0.9953 0.9963 1.0021 0.9975 1.0106 1.0103 1.0013 1.0037 1.0017
dispcorr: -0.011856104 hartree
energy: -615.075132943694
dipole: 4.56631 -3.90224 0.66407 -6.52315 5.19349 -1.32965 -4.40548 4.24940 -0.15608
magnitude: 1.49443 au
magnitude: 3.79854 debye
