program: Orca
programVersion: 5.0.2
elementType: O O N N C C C C C C C C C H H H H H H H H H H H H H H H H H H H H
charge: 0
multiplicity: 1
keywords: wb97x-d3
keywords: def2-TZVPP
keywords: def2/J RIJCOSX
keywords: DEFGRID2
keywords: scfconv7
keywords: smallprint printgap noloewdin
keywords: NOSOSCF
formula: C9H20N2O2
InChI: InChI=1/C9H20N2O2/c1-4-8-13-9(12)10-6-5-7-11(2)3/h10H,4-8H2,1-3H3
33 atoms
O  -1.923168 -0.153809 0.191133
O  -1.229699 1.987326 0.076198
N  3.178684 -0.945972 0.053509
N  0.129719 0.337082 0.843975
C  2.138668 1.297693 -0.264125
C  2.5530 -0.03061 -0.882942
C  1.31252 1.152624 1.007087
C  4.446108 -0.450478 0.539733
C  3.33426 -2.258096 -0.531375
C  -3.225328 0.21846 -0.266067
C  -4.075732 -1.032127 -0.313898
C  -1.017873 0.81846 0.343113
C  -5.490562 -0.711228 -0.770394
H  3.011708 1.914868 -0.035657
H  1.569272 1.854394 -1.01342
H  3.203894 0.171021 -1.75194
H  1.66276 -0.5229 -1.284605
H  1.909786 0.696128 1.795544
H  1.020214 2.137049 1.373613
H  0.222338 -0.659172 0.965061
H  4.875862 -1.158903 1.25005
H  4.324388 0.495631 1.068369
H  5.187816 -0.290981 -0.259959
H  3.994234 -2.273325 -1.413817
H  2.36442 -2.653116 -0.839573
H  3.752271 -2.95099 0.201466
H  -3.161849 0.675076 -1.257959
H  -3.667057 0.952873 0.413307
H  -3.624072 -1.759809 -0.993335
H  -4.103349 -1.493857 0.676634
H  -5.500849 -0.271757 -1.769616
H  -6.104026 -1.611618 -0.80267
H  -5.978658 -0.006508 -0.094558
elementType: O N C H
totalener: -615.06342493 hartree
nucrepener: 845.73073337 hartree
electener: -1460.79415830 hartree
oneelecener: -2513.18881282 hartree
twoeener: 1052.39465452 hartree
cpcmener: -0.01969204 hartree
kineticenergy: 612.20911816 hartree
xcener: -59.911077662770 hartree
chargesum: -0.0000000
charge: -0.329657 -0.544337 -0.240528 -0.233756 -0.115754 -0.103528 -0.067811 -0.190627 -0.190525 0.036432 -0.086049 0.515243 -0.275232 0.079349 0.084407 0.087262 0.090417 0.105432 0.099301 0.172498 0.099456 0.093745 0.078232 0.074296 0.096601 0.097923 0.092397 0.089985 0.063932 0.063303 0.082412 0.093124 0.082056
qa: -0.3297 -0.5443 -0.2405 -0.2338 -0.1158 -0.1035 -0.0678 -0.1906 -0.1905 0.0364 -0.0860 0.5152 -0.2752 0.0793 0.0844 0.0873 0.0904 0.1054 0.0993 0.1725 0.0995 0.0937 0.0782 0.0743 0.0966 0.0979 0.0924 0.0900 0.0639 0.0633 0.0824 0.0931 0.0821
va: 2.0672 1.9621 2.8723 3.1569 3.7887 3.8926 3.9154 3.9373 3.9289 3.8498 3.9234 4.3076 3.9523 1.0111 1.0219 1.0139 1.0059 1.0069 1.0190 1.0216 0.9966 0.9943 1.0049 1.0019 0.9954 0.9962 0.9989 0.9997 1.0100 1.0102 1.0014 1.0036 1.0014
dispcorr: -0.011790293 hartree
energy: -615.075215219248
dipole: 4.56444 -3.91871 0.64574 -6.51833 5.18231 -1.33602 -3.46757 3.43193 -0.03564
magnitude: 1.48431 au
magnitude: 3.77283 debye
