program: Orca
programVersion: 5.0.2
elementType: O O N N C C C C C C C C C H H H H H H H H H H H H H H H H H H H H
charge: 0
multiplicity: 1
keywords: wb97x-d3
keywords: def2-TZVPP
keywords: def2/J RIJCOSX
keywords: DEFGRID2
keywords: scfconv7
keywords: smallprint printgap noloewdin
keywords: NOSOSCF
formula: C9H20N2O2
InChI: InChI=1/C9H20N2O2/c1-4-8-13-9(12)10-6-5-7-11(2)3/h10H,4-8H2,1-3H3
33 atoms
O  -1.816915 -0.114409 0.284093
O  -1.206741 2.045111 0.079062
N  2.947028 -0.968719 0.02826
N  0.209885 0.482132 0.927281
C  2.161884 1.366898 -0.335876
C  2.427883 -0.010639 -0.930536
C  1.387276 1.319197 0.976988
C  4.272955 -0.622449 0.488183
C  2.9246 -2.30934 -0.511492
C  -3.131451 0.180372 -0.193625
C  -3.861127 -1.132899 -0.37495
C  -0.951868 0.898738 0.397987
C  -5.289194 -0.908388 -0.847778
H  3.09348 1.91231 -0.163137
H  1.606703 1.949705 -1.075539
H  3.094206 0.098542 -1.803973
H  1.487505 -0.40921 -1.320964
H  2.020497 0.930956 1.773928
H  1.099473 2.32691 1.277322
H  0.350967 -0.509547 1.045758
H  4.608646 -1.342627 1.236413
H  4.281992 0.359423 0.962627
H  5.02335 -0.607773 -0.318867
H  1.908014 -2.584658 -0.798026
H  3.258093 -3.025011 0.242323
H  3.56659 -2.439502 -1.397476
H  -3.080454 0.719164 -1.143464
H  -3.655587 0.816678 0.525588
H  -3.324532 -1.749371 -1.100881
H  -3.868856 -1.684302 0.568871
H  -5.867403 -0.335573 -0.120657
H  -5.318835 -0.366098 -1.794651
H  -5.802278 -1.858108 -0.999187
elementType: O N C H
totalener: -615.06282080 hartree
nucrepener: 853.63579956 hartree
electener: -1468.69862036 hartree
oneelecener: -2528.97223181 hartree
twoeener: 1060.27361144 hartree
cpcmener: -0.01918821 hartree
kineticenergy: 612.21008202 hartree
xcener: -59.911214952998 hartree
chargesum: 0.0000000
charge: -0.328509 -0.541177 -0.248149 -0.234522 -0.119862 -0.103691 -0.068540 -0.190392 -0.187844 0.036468 -0.084732 0.511160 -0.275115 0.080172 0.085381 0.090563 0.094833 0.104897 0.100013 0.170679 0.099693 0.093751 0.078481 0.096043 0.098018 0.076471 0.087768 0.094231 0.063280 0.063367 0.082464 0.081973 0.092829
qa: -0.3285 -0.5412 -0.2481 -0.2345 -0.1199 -0.1037 -0.0685 -0.1904 -0.1878 0.0365 -0.0847 0.5112 -0.2751 0.0802 0.0854 0.0906 0.0948 0.1049 0.1000 0.1707 0.0997 0.0938 0.0785 0.0960 0.0980 0.0765 0.0878 0.0942 0.0633 0.0634 0.0825 0.0820 0.0928
va: 2.0661 1.9663 2.8649 3.1481 3.7740 3.8919 3.9224 3.9369 3.9222 3.8501 3.9216 4.3149 3.9526 1.0112 1.0201 1.0138 1.0032 1.0054 1.0182 1.0287 0.9964 0.9957 1.0049 0.9957 0.9962 1.0025 1.0021 0.9973 1.0105 1.0101 1.0016 1.0013 1.0036
dispcorr: -0.012075616 hartree
energy: -615.074896417361
dipole: 4.21196 -3.49036 0.72160 -7.44769 6.07435 -1.37333 -3.99797 3.91201 -0.08596
magnitude: 1.55375 au
magnitude: 3.94931 debye
