program: Orca
programVersion: 5.0.2
elementType: O O N N C C C C C C C C C H H H H H H H H H H H H H H H H H H H H
charge: 0
multiplicity: 1
keywords: wb97x-d3
keywords: def2-TZVPP
keywords: def2/J RIJCOSX
keywords: DEFGRID2
keywords: scfconv7
keywords: smallprint printgap noloewdin
keywords: NOSOSCF
formula: C9H20N2O2
InChI: InChI=1/C9H20N2O2/c1-4-8-13-9(12)10-6-5-7-11(2)3/h10H,4-8H2,1-3H3
33 atoms
O  -1.869161 -0.134536 0.280354
O  -1.197395 2.006803 0.066728
N  3.053878 -0.962807 0.020275
N  0.168139 0.413044 0.938334
C  2.130832 1.33278 -0.286447
C  2.456719 -0.019405 -0.907219
C  1.354458 1.235221 1.022039
C  4.354859 -0.529739 0.479699
C  3.132598 -2.283035 -0.564787
C  -3.168124 0.197469 -0.217273
C  -3.952261 -1.089146 -0.360985
C  -0.976872 0.856562 0.395132
C  -5.365229 -0.815425 -0.852815
H  3.039242 1.91219 -0.101634
H  1.555188 1.90672 -1.017216
H  3.096102 0.141921 -1.792841
H  1.531355 -0.464069 -1.283772
H  1.983063 0.807987 1.802234
H  1.076376 2.232794 1.363308
H  0.278993 -0.578918 1.076817
H  5.082797 -0.396251 -0.336869
H  4.768503 -1.264866 1.171963
H  4.28894 0.415289 1.02001
H  3.776249 -2.333098 -1.457391
H  2.138512 -2.626823 -0.856064
H  3.525708 -2.994589 0.163548
H  -3.087682 0.702174 -1.183732
H  -3.670431 0.878182 0.476477
H  -3.438877 -1.752877 -1.061796
H  -3.991156 -1.607334 0.600804
H  -5.363427 -0.301588 -1.816049
H  -5.920046 -1.745126 -0.980004
H  -5.92214 -0.19517 -0.148059
elementType: O N C H
totalener: -615.06323373 hartree
nucrepener: 850.20586354 hartree
electener: -1465.26909727 hartree
oneelecener: -2522.13729489 hartree
twoeener: 1056.86819763 hartree
cpcmener: -0.01939008 hartree
kineticenergy: 612.20539432 hartree
xcener: -59.910062100528 hartree
chargesum: -0.0000000
charge: -0.329511 -0.540131 -0.242300 -0.235602 -0.118438 -0.106410 -0.067172 -0.190607 -0.190110 0.036088 -0.084700 0.512736 -0.274984 0.080376 0.085267 0.089107 0.092580 0.104773 0.100667 0.171135 0.079056 0.099129 0.093079 0.075138 0.096732 0.098036 0.088720 0.093378 0.063587 0.063237 0.081895 0.092657 0.082592
qa: -0.3295 -0.5401 -0.2423 -0.2356 -0.1184 -0.1064 -0.0672 -0.1906 -0.1901 0.0361 -0.0847 0.5127 -0.2750 0.0804 0.0853 0.0891 0.0926 0.1048 0.1007 0.1711 0.0791 0.0991 0.0931 0.0751 0.0967 0.0980 0.0887 0.0934 0.0636 0.0632 0.0819 0.0927 0.0826
va: 2.0661 1.9669 2.8694 3.1534 3.7773 3.8962 3.9196 3.9381 3.9266 3.8503 3.9220 4.3115 3.9525 1.0112 1.0219 1.0135 1.0044 1.0061 1.0171 1.0250 1.0044 0.9967 0.9947 1.0022 0.9954 0.9964 1.0013 0.9976 1.0104 1.0102 1.0014 1.0037 1.0015
dispcorr: -0.011952847 hartree
energy: -615.075186571953
dipole: 4.38046 -3.71060 0.66986 -6.94389 5.60664 -1.33726 -3.98630 3.93964 -0.04665
magnitude: 1.49638 au
magnitude: 3.80349 debye
