program: Orca
programVersion: 5.0.2
elementType: O O N N C C C C C C C C C H H H H H H H H H H H H H H H H H H H H
charge: 0
multiplicity: 1
keywords: wb97x-d3
keywords: def2-TZVPP
keywords: def2/J RIJCOSX
keywords: DEFGRID2
keywords: scfconv7
keywords: smallprint printgap noloewdin
keywords: NOSOSCF
formula: C9H20N2O2
InChI: InChI=1/C9H20N2O2/c1-4-8-13-9(12)10-6-5-7-11(2)3/h10H,4-8H2,1-3H3
33 atoms
O  -2.040363 0.335202 0.079508
O  -0.446237 -0.590628 -1.2133
N  2.883363 -0.834623 -0.057153
N  -0.16128 1.44702 -0.234327
C  2.210183 1.496087 0.490649
C  2.344518 0.053271 0.95862
C  1.205488 1.694578 -0.638896
C  2.547723 -2.215238 0.207323
C  4.311757 -0.678214 -0.213313
C  -2.877815 -0.810994 -0.096173
C  -4.14688 -0.589277 0.695788
C  -0.840682 0.322687 -0.511634
C  -4.976188 0.595285 0.222925
H  1.916088 2.111519 1.346203
H  3.17694 1.888261 0.163741
H  1.357204 -0.31579 1.249314
H  2.951531 0.027708 1.879813
H  1.268862 2.721372 -1.003758
H  1.444805 1.048712 -1.481364
H  -0.582768 2.108708 0.399561
H  2.923495 -2.852135 -0.596103
H  1.464691 -2.342212 0.244907
H  2.963094 -2.601051 1.152462
H  4.673047 -1.311577 -1.025888
H  4.880149 -0.94374 0.693523
H  4.570168 0.349486 -0.471804
H  -2.362607 -1.707743 0.257333
H  -3.107697 -0.95055 -1.156354
H  -4.734842 -1.506471 0.608189
H  -3.903216 -0.484819 1.756692
H  -5.245348 0.494739 -0.830481
H  -5.903697 0.670603 0.791627
H  -4.447395 1.541592 0.34148
elementType: O N C H
totalener: -615.06256805 hartree
nucrepener: 863.99947804 hartree
electener: -1479.06204609 hartree
oneelecener: -2550.35230190 hartree
twoeener: 1071.29025581 hartree
cpcmener: -0.02371289 hartree
kineticenergy: 612.19620992 hartree
xcener: -59.908310754745 hartree
chargesum: 0.0000000
charge: -0.332688 -0.539704 -0.246468 -0.234423 -0.115904 -0.093979 -0.029776 -0.184851 -0.194016 0.018525 -0.101073 0.513219 -0.255087 0.075683 0.070641 0.092125 0.086895 0.108380 0.085465 0.168365 0.097851 0.085858 0.075810 0.098864 0.072415 0.098535 0.106149 0.095144 0.065682 0.063300 0.078448 0.090766 0.079850
qa: -0.3327 -0.5397 -0.2465 -0.2344 -0.1159 -0.0940 -0.0298 -0.1849 -0.1940 0.0185 -0.1011 0.5132 -0.2551 0.0757 0.0706 0.0921 0.0869 0.1084 0.0855 0.1684 0.0979 0.0859 0.0758 0.0989 0.0724 0.0985 0.1061 0.0951 0.0657 0.0633 0.0784 0.0908 0.0798
va: 2.0604 1.9643 2.8492 3.1769 3.8688 3.8654 3.8310 3.9308 3.9495 3.8527 3.9473 4.3013 3.9148 1.0211 1.0180 0.9991 1.0141 1.0032 1.0469 1.0179 0.9945 1.0060 1.0006 0.9960 1.0060 0.9927 1.0017 0.9999 1.0114 1.0136 1.0028 1.0047 1.0103
dispcorr: -0.012516638 hartree
energy: -615.075084688454
dipole: 3.17554 -3.32478 -0.14924 -2.01057 2.99391 0.98334 4.48044 -3.23174 1.24870
magnitude: 1.59640 au
magnitude: 4.05772 debye
