program: Orca
programVersion: 5.0.2
elementType: O O N N C C C C C C C C C H H H H H H H H H H H H H H H H H H H H
charge: 0
multiplicity: 1
keywords: wb97x-d3
keywords: def2-TZVPP
keywords: def2/J RIJCOSX
keywords: DEFGRID2
keywords: scfconv7
keywords: smallprint printgap noloewdin
keywords: NOSOSCF
formula: C9H20N2O2
InChI: InChI=1/C9H20N2O2/c1-4-8-13-9(12)10-6-5-7-11(2)3/h10H,4-8H2,1-3H3
33 atoms
O  -1.708853 0.231138 0.371222
O  -1.182356 2.278053 -0.402971
N  2.20464 -1.077544 0.163049
N  0.292368 1.046073 0.825043
C  2.335611 1.321712 -0.563964
C  3.068567 0.032655 -0.212981
C  1.461196 1.859506 0.562498
C  1.430608 -1.567676 -0.95808
C  2.978215 -2.151469 0.750331
C  -3.023472 0.33463 -0.181659
C  -3.772816 -0.935011 0.155278
C  -0.880498 1.267715 0.205307
C  -3.152222 -2.194546 -0.428501
H  3.0976 2.071832 -0.793724
H  1.739314 1.21317 -1.474471
H  3.725876 0.241319 0.636402
H  3.729665 -0.245171 -1.052028
H  2.045319 1.919658 1.484202
H  1.137242 2.874388 0.336693
H  0.505028 0.092462 1.091746
H  0.784844 -0.789376 -1.365938
H  0.78366 -2.385797 -0.635742
H  2.057678 -1.943064 -1.782754
H  3.512222 -1.794875 1.632848
H  3.721758 -2.582291 0.061123
H  2.317597 -2.959611 1.069291
H  -2.966101 0.467663 -1.266085
H  -3.539936 1.202658 0.236293
H  -3.871661 -1.027127 1.240456
H  -4.78767 -0.811559 -0.23238
H  -3.775372 -3.065282 -0.220397
H  -3.047378 -2.119028 -1.513055
H  -2.164401 -2.397941 -0.012931
elementType: O N C H
totalener: -615.06303077 hartree
nucrepener: 882.02706798 hartree
electener: -1497.09009876 hartree
oneelecener: -2585.80633809 hartree
twoeener: 1088.71623933 hartree
cpcmener: -0.01869466 hartree
kineticenergy: 612.20675834 hartree
xcener: -59.909946397285 hartree
chargesum: 0.0000000
charge: -0.328069 -0.539663 -0.248404 -0.251126 -0.131809 -0.079507 -0.042189 -0.206341 -0.192333 0.022505 -0.098483 0.501236 -0.256217 0.083734 0.079866 0.089833 0.081584 0.098394 0.096208 0.176963 0.095599 0.106501 0.091134 0.099097 0.078715 0.098758 0.095278 0.101774 0.063378 0.065578 0.092539 0.079202 0.076263
qa: -0.3281 -0.5397 -0.2484 -0.2511 -0.1318 -0.0795 -0.0422 -0.2063 -0.1923 0.0225 -0.0985 0.5012 -0.2562 0.0837 0.0799 0.0898 0.0816 0.0984 0.0962 0.1770 0.0956 0.1065 0.0911 0.0991 0.0787 0.0988 0.0953 0.1018 0.0634 0.0656 0.0925 0.0792 0.0763
va: 2.0589 1.9719 2.8717 3.1290 3.8563 3.8876 3.8861 3.9184 3.9219 3.8520 3.9414 4.3237 3.9178 1.0183 1.0105 1.0007 1.0137 1.0027 1.0278 1.0564 0.9976 0.9928 1.0089 0.9978 1.0017 0.9965 1.0000 1.0036 1.0134 1.0117 1.0057 1.0021 1.0091
dispcorr: -0.013352908 hartree
energy: -615.076383683001
dipole: 4.75556 -3.86168 0.89388 -11.57215 10.13205 -1.44010 -2.66512 2.79783 0.13271
magnitude: 1.70015 au
magnitude: 4.32144 debye
