program: Orca
programVersion: 5.0.2
elementType: O O N N C C C C C C C C C H H H H H H H H H H H H H H H H H H H H
charge: 0
multiplicity: 1
keywords: wb97x-d3
keywords: def2-TZVPP
keywords: def2/J RIJCOSX
keywords: DEFGRID2
keywords: scfconv7
keywords: smallprint printgap noloewdin
keywords: NOSOSCF
formula: C9H20N2O2
InChI: InChI=1/C9H20N2O2/c1-4-8-13-9(12)10-6-5-7-11(2)3/h10H,4-8H2,1-3H3
33 atoms
O  -1.670676 0.038395 -0.018742
O  -1.199805 2.1936 -0.470244
N  2.363582 -1.032973 0.180842
N  0.214923 0.889957 0.755283
C  2.390794 1.426064 -0.319651
C  3.177122 0.163452 0.009974
C  1.347947 1.789656 0.73205
C  1.790769 -1.48247 -1.072152
C  3.136265 -2.094084 0.792334
C  -2.923594 0.149248 -0.698439
C  -3.626901 -1.186687 -0.604911
C  -0.898398 1.130478 0.039542
C  -3.95827 -1.612283 0.817497
H  3.11149 2.24551 -0.385666
H  1.91702 1.363428 -1.303228
H  3.708668 0.336827 0.950526
H  3.954758 0.009074 -0.757813
H  1.809969 1.783318 1.722362
H  0.985596 2.803351 0.569194
H  0.454982 -0.076869 0.937299
H  2.55337 -1.731107 -1.826566
H  1.135416 -0.725693 -1.503433
H  1.185808 -2.375008 -0.905536
H  3.519882 -1.771414 1.761514
H  3.994951 -2.416831 0.183716
H  2.505624 -2.968288 0.962096
H  -2.760307 0.420845 -1.744546
H  -3.533323 0.932297 -0.238761
H  -4.54792 -1.096998 -1.186459
H  -3.02732 -1.954792 -1.101333
H  -4.527791 -2.542225 0.821706
H  -3.061507 -1.77967 1.414818
H  -4.560708 -0.857143 1.326587
elementType: O N C H
totalener: -615.06320604 hartree
nucrepener: 875.22627458 hartree
electener: -1490.28948062 hartree
oneelecener: -2572.23823787 hartree
twoeener: 1081.94875725 hartree
cpcmener: -0.01867441 hartree
kineticenergy: 612.20683854 hartree
xcener: -59.909846996567 hartree
chargesum: -0.0000000
charge: -0.330513 -0.539378 -0.252477 -0.253967 -0.129286 -0.078519 -0.044522 -0.198683 -0.191959 0.020074 -0.100497 0.506359 -0.254943 0.083313 0.079517 0.089705 0.081835 0.098352 0.096931 0.177790 0.087740 0.094360 0.105569 0.098009 0.079323 0.099349 0.104370 0.094824 0.065008 0.063260 0.090570 0.080320 0.078163
qa: -0.3305 -0.5394 -0.2525 -0.2540 -0.1293 -0.0785 -0.0445 -0.1987 -0.1920 0.0201 -0.1005 0.5064 -0.2549 0.0833 0.0795 0.0897 0.0818 0.0984 0.0969 0.1778 0.0877 0.0944 0.1056 0.0980 0.0793 0.0993 0.1044 0.0948 0.0650 0.0633 0.0906 0.0803 0.0782
va: 2.0534 1.9736 2.8715 3.1313 3.8557 3.8879 3.8849 3.9138 3.9222 3.8511 3.9443 4.3107 3.9146 1.0185 1.0104 1.0009 1.0137 1.0024 1.0281 1.0557 1.0087 0.9991 0.9964 0.9983 1.0013 0.9961 1.0032 1.0002 1.0117 1.0133 1.0047 1.0105 1.0030
dispcorr: -0.012874598 hartree
energy: -615.076080636114
dipole: 4.46422 -3.47007 0.99415 -9.98614 8.57813 -1.40802 -0.42014 0.48215 0.06201
magnitude: 1.72473 au
magnitude: 4.38391 debye
