program: Orca
programVersion: 5.0.2
elementType: O O N N C C C C C C C C C H H H H H H H H H H H H H H H H H H H H
charge: 0
multiplicity: 1
keywords: wb97x-d3
keywords: def2-TZVPP
keywords: def2/J RIJCOSX
keywords: DEFGRID2
keywords: scfconv7
keywords: smallprint printgap noloewdin
keywords: NOSOSCF
formula: C9H20N2O2
InChI: InChI=1/C9H20N2O2/c1-4-8-13-9(12)10-6-5-7-11(2)3/h10H,4-8H2,1-3H3
33 atoms
O  -1.716336 0.186267 0.292427
O  -1.270825 2.308409 -0.320143
N  2.233589 -1.080416 0.09978
N  0.293819 0.993743 0.692456
C  2.420449 1.347249 -0.53106
C  3.12103 0.050591 -0.142757
C  1.43532 1.862151 0.511245
C  1.565023 -1.52105 -1.108529
C  2.965155 -2.17718 0.69823
C  -3.070547 0.31677 -0.145319
C  -3.810219 -0.944459 0.243465
C  -0.915327 1.253421 0.172484
C  -3.263442 -2.210375 -0.3989
H  3.199095 2.103914 -0.660441
H  1.922479 1.260511 -1.500324
H  3.680871 0.23195 0.779904
H  3.871281 -0.195205 -0.913743
H  1.946048 1.97401 1.471655
H  1.080615 2.8531 0.232351
H  0.528039 0.030294 0.902902
H  2.265609 -1.862763 -1.886271
H  0.957506 -0.725034 -1.538984
H  0.892774 -2.349336 -0.878983
H  3.781315 -2.553196 0.062234
H  2.292258 -3.012322 0.898833
H  3.401645 -1.868434 1.649543
H  -3.102006 0.460825 -1.22946
H  -3.537435 1.186921 0.322227
H  -3.814975 -1.043244 1.332695
H  -4.852494 -0.802124 -0.053254
H  -3.279326 -2.141344 -1.488482
H  -2.236394 -2.414504 -0.093978
H  -3.862373 -3.077261 -0.1169
elementType: O N C H
totalener: -615.06296219 hartree
nucrepener: 877.67284076 hartree
electener: -1492.73580295 hartree
oneelecener: -2577.12276738 hartree
twoeener: 1084.38696444 hartree
cpcmener: -0.01868382 hartree
kineticenergy: 612.21082086 hartree
xcener: -59.912030578614 hartree
chargesum: 0.0000000
charge: -0.330981 -0.543226 -0.246395 -0.253567 -0.133504 -0.077977 -0.037949 -0.205846 -0.191843 0.025339 -0.100543 0.506716 -0.254023 0.082889 0.079638 0.090385 0.081293 0.096021 0.093830 0.178588 0.090087 0.097654 0.106404 0.079690 0.099042 0.099366 0.096056 0.098038 0.062947 0.064990 0.078288 0.077106 0.091486
qa: -0.3310 -0.5432 -0.2464 -0.2536 -0.1335 -0.0780 -0.0379 -0.2058 -0.1918 0.0253 -0.1005 0.5067 -0.2540 0.0829 0.0796 0.0904 0.0813 0.0960 0.0938 0.1786 0.0901 0.0977 0.1064 0.0797 0.0990 0.0994 0.0961 0.0980 0.0629 0.0650 0.0783 0.0771 0.0915
va: 2.0533 1.9706 2.8819 3.1245 3.8787 3.8833 3.8823 3.9147 3.9180 3.8524 3.9457 4.3133 3.9169 1.0178 1.0086 1.0004 1.0133 1.0007 1.0314 1.0611 1.0085 0.9989 0.9940 1.0021 0.9966 0.9979 0.9985 1.0055 1.0136 1.0119 1.0027 1.0093 1.0053
dispcorr: -0.012981778 hartree
energy: -615.075943969938
dipole: 4.97065 -3.96195 1.00870 -11.40443 9.96372 -1.44071 -2.48733 2.57948 0.09215
magnitude: 1.76114 au
magnitude: 4.47645 debye
