program: Orca
programVersion: 5.0.2
elementType: O O N N C C C C C C C C C H H H H H H H H H H H H H H H H H H H H
charge: 0
multiplicity: 1
keywords: wb97x-d3
keywords: def2-TZVPP
keywords: def2/J RIJCOSX
keywords: DEFGRID2
keywords: scfconv7
keywords: smallprint printgap noloewdin
keywords: NOSOSCF
formula: C9H20N2O2
InChI: InChI=1/C9H20N2O2/c1-4-8-13-9(12)10-6-5-7-11(2)3/h10H,4-8H2,1-3H3
33 atoms
O  -1.546594 0.016818 -0.322037
O  -1.284482 2.136213 0.394658
N  2.43287 -0.987968 -0.176449
N  0.397019 1.001241 -0.651813
C  2.458063 1.37861 0.665137
C  3.248289 0.163825 0.191048
C  1.476615 1.921277 -0.36734
C  1.79738 -1.596217 0.975057
C  3.220593 -1.96611 -0.896009
C  -2.906719 0.011633 0.113169
C  -3.461101 -1.376579 -0.126782
C  -0.83646 1.139285 -0.140743
C  -4.920442 -1.465558 0.291533
H  1.931882 1.175096 1.601744
H  3.182845 2.164894 0.892827
H  3.990172 -0.106951 0.961303
H  3.8210 0.457819 -0.693697
H  1.055595 2.865534 -0.025766
H  2.008715 2.136964 -1.298067
H  0.708594 0.066898 -0.896174
H  1.171713 -2.431249 0.656214
H  1.14889 -0.887188 1.489788
H  2.520953 -1.980564 1.710476
H  4.060103 -2.367133 -0.308152
H  3.631689 -1.525797 -1.805691
H  2.592931 -2.808268 -1.191519
H  -3.482545 0.756206 -0.44452
H  -2.968069 0.267413 1.174569
H  -3.364731 -1.632942 -1.185034
H  -2.870799 -2.106684 0.433293
H  -5.051404 -1.231977 1.34968
H  -5.544293 -0.775192 -0.279127
H  -5.310783 -2.470126 0.127894
elementType: O N C H
totalener: -615.06320126 hartree
nucrepener: 866.84030883 hartree
electener: -1481.90351009 hartree
oneelecener: -2555.43347929 hartree
twoeener: 1073.52996920 hartree
cpcmener: -0.01894187 hartree
kineticenergy: 612.21055833 hartree
xcener: -59.911707239170 hartree
chargesum: 0.0000000
charge: -0.327851 -0.541971 -0.246342 -0.257336 -0.135150 -0.076786 -0.035405 -0.204253 -0.189925 0.036232 -0.083707 0.501140 -0.276092 0.079483 0.083189 0.081295 0.090472 0.093928 0.095021 0.179853 0.107053 0.096945 0.088232 0.081194 0.098861 0.099228 0.091478 0.088099 0.063187 0.062572 0.081835 0.082321 0.093197
qa: -0.3279 -0.5420 -0.2463 -0.2573 -0.1351 -0.0768 -0.0354 -0.2043 -0.1899 0.0362 -0.0837 0.5011 -0.2761 0.0795 0.0832 0.0813 0.0905 0.0939 0.0950 0.1799 0.1071 0.0969 0.0882 0.0812 0.0989 0.0992 0.0915 0.0881 0.0632 0.0626 0.0818 0.0823 0.0932
va: 2.0573 1.9712 2.8898 3.1237 3.8813 3.8821 3.8811 3.9148 3.9152 3.8539 3.9217 4.3156 3.9526 1.0088 1.0181 1.0136 1.0003 1.0309 1.0011 1.0646 0.9963 0.9987 1.0084 1.0016 0.9979 0.9963 0.9983 1.0010 1.0102 1.0103 1.0015 1.0016 1.0034
dispcorr: -0.012485331 hartree
energy: -615.075686589624
dipole: 3.15439 -1.99110 1.16329 -10.01778 8.58938 -1.42840 2.09453 -2.19104 -0.09650
magnitude: 1.84469 au
magnitude: 4.68884 debye
