program: Orca
programVersion: 5.0.2
elementType: O O N N C C C C C C C C C H H H H H H H H H H H H H H H H H H H H
charge: 0
multiplicity: 1
keywords: wb97x-d3
keywords: def2-TZVPP
keywords: def2/J RIJCOSX
keywords: DEFGRID2
keywords: scfconv7
keywords: smallprint printgap noloewdin
keywords: NOSOSCF
formula: C9H20N2O2
InChI: InChI=1/C9H20N2O2/c1-4-8-13-9(12)10-6-5-7-11(2)3/h10H,4-8H2,1-3H3
33 atoms
O  -1.607343 -0.060103 -1.076545
O  -1.629038 1.923404 0.011723
N  2.292416 -0.966443 -0.051384
N  0.29832 0.996719 -0.773945
C  1.991523 1.288698 1.012834
C  2.937674 0.165728 0.603006
C  1.228297 1.912418 -0.150557
C  3.278368 -1.836125 -0.659566
C  1.453233 -1.716635 0.861132
C  -3.015837 -0.250536 -0.930969
C  -3.326757 -1.284787 0.133223
C  -1.025091 1.029288 -0.55061
C  -2.899412 -0.892433 1.539114
H  1.286872 0.960681 1.781791
H  2.600476 2.069233 1.47683
H  3.5109 -0.163353 1.486345
H  3.668663 0.578787 -0.098582
H  0.683126 2.79204 0.187595
H  1.937682 2.258519 -0.907095
H  0.711726 0.115332 -1.0589
H  3.983784 -2.269313 0.066162
H  3.859897 -1.287242 -1.402007
H  2.78401 -2.662222 -1.172916
H  2.016553 -2.151556 1.70129
H  0.963054 -2.53356 0.329387
H  0.666179 -1.090352 1.281978
H  -3.370297 -0.596415 -1.903248
H  -3.515947 0.69451 -0.714454
H  -4.408063 -1.445626 0.107807
H  -2.871171 -2.239959 -0.142528
H  -3.214843 -1.647902 2.259931
H  -1.815389 -0.801864 1.628666
H  -3.341717 0.057195 1.844166
elementType: O N C H
totalener: -615.06160561 hartree
nucrepener: 891.42091583 hartree
electener: -1506.48252144 hartree
oneelecener: -2604.70275133 hartree
twoeener: 1098.22022989 hartree
cpcmener: -0.01861795 hartree
kineticenergy: 612.20492034 hartree
xcener: -59.912095408192 hartree
chargesum: 0.0000000
charge: -0.334100 -0.537884 -0.246687 -0.246934 -0.136859 -0.072714 -0.039935 -0.191020 -0.198027 0.017820 -0.085270 0.488758 -0.270093 0.079555 0.084163 0.081246 0.090847 0.095062 0.096862 0.178792 0.080557 0.098749 0.099098 0.091902 0.107323 0.084796 0.103542 0.093982 0.066180 0.063935 0.094455 0.074876 0.087023
qa: -0.3341 -0.5379 -0.2467 -0.2469 -0.1369 -0.0727 -0.0399 -0.1910 -0.1980 0.0178 -0.0853 0.4888 -0.2701 0.0796 0.0842 0.0812 0.0908 0.0951 0.0969 0.1788 0.0806 0.0987 0.0991 0.0919 0.1073 0.0848 0.1035 0.0940 0.0662 0.0639 0.0945 0.0749 0.0870
va: 2.0491 1.9712 2.8892 3.1226 3.8813 3.8821 3.8792 3.9172 3.9216 3.8639 3.8717 4.3443 3.9351 1.0079 1.0186 1.0143 1.0000 1.0306 1.0013 1.0643 1.0018 0.9981 0.9963 1.0093 0.9963 0.9926 0.9998 1.0207 1.0151 1.0113 1.0057 0.9981 1.0075
dispcorr: -0.014010776 hartree
energy: -615.075616390740
dipole: 5.90586 -4.69885 1.20701 -8.93297 7.58729 -1.34568 6.26239 -6.18346 0.07894
magnitude: 1.80941 au
magnitude: 4.59914 debye
