program: Orca
programVersion: 5.0.2
elementType: O O N N C C C C C C C C C H H H H H H H H H H H H H H H H H H H H
charge: 0
multiplicity: 1
keywords: wb97x-d3
keywords: def2-TZVPP
keywords: def2/J RIJCOSX
keywords: DEFGRID2
keywords: scfconv7
keywords: smallprint printgap noloewdin
keywords: NOSOSCF
formula: C9H20N2O2
InChI: InChI=1/C9H20N2O2/c1-4-8-13-9(12)10-6-5-7-11(2)3/h10H,4-8H2,1-3H3
33 atoms
O  -2.024622 -0.107775 0.908709
O  -1.467336 1.964914 0.210573
N  2.861402 -0.991682 -0.035051
N  0.081393 0.539817 1.06364
C  1.771164 1.163764 -0.652414
C  2.052617 -0.28883 -1.014126
C  1.239722 1.351648 0.763487
C  4.201667 -0.457605 0.056008
C  2.896023 -2.409024 -0.31402
C  -3.404144 0.113407 0.600685
C  -3.725054 -0.048352 -0.871698
C  -1.15814 0.885071 0.679435
C  -3.327203 -1.400017 -1.443173
H  2.666955 1.780009 -0.76623
H  1.048246 1.55465 -1.373421
H  2.507362 -0.322494 -2.019862
H  1.099806 -0.819294 -1.100385
H  2.007832 1.095801 1.49232
H  0.993914 2.400295 0.931485
H  0.243062 -0.411866 1.353939
H  4.765753 -0.993887 0.821025
H  4.189356 0.592872 0.347415
H  4.765656 -0.534518 -0.88756
H  3.361509 -2.656759 -1.281301
H  1.88434 -2.818711 -0.320634
H  3.456821 -2.932348 0.462663
H  -3.724022 1.091635 0.965443
H  -3.93361 -0.642664 1.18216
H  -4.806239 0.086469 -0.966528
H  -3.268459 0.755728 -1.451935
H  -3.789395 -2.220194 -0.890618
H  -3.643355 -1.48728 -2.483181
H  -2.247333 -1.552798 -1.422223
elementType: O N C H
totalener: -615.06220684 hartree
nucrepener: 870.17124894 hartree
electener: -1485.23345578 hartree
oneelecener: -2562.13565474 hartree
twoeener: 1076.90219896 hartree
cpcmener: -0.01896642 hartree
kineticenergy: 612.21475752 hartree
xcener: -59.912897652941 hartree
chargesum: 0.0000000
charge: -0.339364 -0.541834 -0.243312 -0.233326 -0.118352 -0.105732 -0.067360 -0.190019 -0.189205 0.021921 -0.110577 0.513748 -0.260395 0.080925 0.085040 0.088527 0.093599 0.103870 0.099043 0.170923 0.099437 0.093536 0.078385 0.075065 0.096080 0.098097 0.101918 0.108164 0.074014 0.068221 0.079311 0.092081 0.077571
qa: -0.3394 -0.5418 -0.2433 -0.2333 -0.1184 -0.1057 -0.0674 -0.1900 -0.1892 0.0219 -0.1106 0.5137 -0.2604 0.0809 0.0850 0.0885 0.0936 0.1039 0.0990 0.1709 0.0994 0.0935 0.0784 0.0751 0.0961 0.0981 0.1019 0.1082 0.0740 0.0682 0.0793 0.0921 0.0776
va: 2.0530 1.9632 2.8690 3.1571 3.7807 3.8979 3.9232 3.9373 3.9273 3.8612 3.8624 4.3202 3.9294 1.0112 1.0212 1.0140 1.0022 1.0068 1.0191 1.0241 0.9965 0.9951 1.0049 1.0021 0.9957 0.9961 1.0154 0.9968 1.0129 1.0232 1.0017 1.0044 1.0073
dispcorr: -0.012862403 hartree
energy: -615.075069246044
dipole: 7.11854 -6.42880 0.68973 -7.73255 6.47133 -1.26122 -6.77486 6.72469 -0.05018
magnitude: 1.43838 au
magnitude: 3.65606 debye
