program: Orca
programVersion: 5.0.2
elementType: O O N N C C C C C C C C C H H H H H H H H H H H H H H H H H H H H
charge: 0
multiplicity: 1
keywords: wb97x-d3
keywords: def2-TZVPP
keywords: def2/J RIJCOSX
keywords: DEFGRID2
keywords: scfconv7
keywords: smallprint printgap noloewdin
keywords: NOSOSCF
formula: C9H20N2O2
InChI: InChI=1/C9H20N2O2/c1-4-8-13-9(12)10-6-5-7-11(2)3/h10H,4-8H2,1-3H3
33 atoms
O  -1.735029 -0.299012 0.942963
O  -1.407662 1.801041 0.179007
N  2.805881 -0.900481 -0.030132
N  0.274576 0.598963 1.122889
C  1.863988 1.319027 -0.655344
C  2.084076 -0.140627 -1.034471
C  1.349449 1.499323 0.770541
C  4.181926 -0.47561 0.096602
C  2.727746 -2.3198 -0.293025
C  -3.103365 -0.284201 0.531854
C  -3.278983 -0.585848 -0.944283
C  -0.985952 0.783186 0.695162
C  -4.754684 -0.673244 -1.304782
H  2.782073 1.902325 -0.763994
H  1.153102 1.745389 -1.36781
H  2.579402 -0.185594 -2.019799
H  1.108445 -0.615583 -1.1702
H  2.15346 1.323699 1.484157
H  1.023814 2.528647 0.923136
H  0.546799 -0.33362 1.395372
H  4.673117 -1.032956 0.896286
H  4.245166 0.581434 0.357399
H  4.769828 -0.626483 -0.823129
H  3.200767 -2.619048 -1.241879
H  1.685007 -2.640344 -0.327898
H  3.216349 -2.878319 0.507528
H  -3.574992 0.665038 0.797456
H  -3.576941 -1.06299 1.131195
H  -2.800085 0.188124 -1.547518
H  -2.782607 -1.530234 -1.182686
H  -5.274989 0.262667 -1.092739
H  -4.885928 -0.885937 -2.365778
H  -5.258193 -1.464907 -0.746727
elementType: O N C H
totalener: -615.06174428 hartree
nucrepener: 868.72508166 hartree
electener: -1483.78682594 hartree
oneelecener: -2559.22766159 hartree
twoeener: 1075.44083565 hartree
cpcmener: -0.01840294 hartree
kineticenergy: 612.20818905 hartree
xcener: -59.911184221490 hartree
chargesum: -0.0000000
charge: -0.336357 -0.538186 -0.252829 -0.229688 -0.123519 -0.105292 -0.069663 -0.189939 -0.186351 0.033662 -0.095997 0.504862 -0.273359 0.082449 0.085977 0.091582 0.097752 0.103462 0.101766 0.168885 0.099787 0.093954 0.077805 0.077596 0.095259 0.098731 0.089141 0.108230 0.068428 0.062978 0.084269 0.092877 0.081729
qa: -0.3364 -0.5382 -0.2528 -0.2297 -0.1235 -0.1053 -0.0697 -0.1899 -0.1864 0.0337 -0.0960 0.5049 -0.2734 0.0824 0.0860 0.0916 0.0978 0.1035 0.1018 0.1689 0.0998 0.0940 0.0778 0.0776 0.0953 0.0987 0.0891 0.1082 0.0684 0.0630 0.0843 0.0929 0.0817
va: 2.0686 1.9666 2.8609 3.1481 3.7560 3.9006 3.9269 3.9368 3.9187 3.8491 3.8601 4.3282 3.9496 1.0110 1.0204 1.0139 1.0000 1.0052 1.0164 1.0329 0.9961 0.9961 1.0048 1.0028 0.9965 0.9962 1.0145 0.9994 1.0242 1.0116 1.0010 1.0025 1.0016
dispcorr: -0.012787209 hartree
energy: -615.074531492671
dipole: 4.75556 -3.88559 0.86997 -6.49816 5.23191 -1.26625 -6.72899 6.61075 -0.11825
magnitude: 1.54085 au
magnitude: 3.91652 debye
