program: Gaussian 09
title: 000002179
version: EM64L-G09RevD.01
frameworkgroup: C1[X(C21H19N3O3S)]
method: RPBEPBE
basis: SDD
operation: Freq
keyword: #p
keyword: freq=noraman
keyword: PBEPBE/SDD
title: #p freq=noraman PBEPBE/SDD
converged: YES YES NO NO
title: Mulliken charges:
elementType: S O O O N N N C C C C C C C C C C C C C C C C C C C C C H H H H H H H H H H H H H H H H H H H
charge: 0.966724 -0.319831 -0.543798 -0.553763 -0.481169 -0.032661 -0.468100 0.224099 0.243399 0.224797 -0.092188 -0.104997 0.271118 -0.385004 -0.340860 0.163790 0.261429 -0.277889 -0.306789 -0.307697 -0.400898 -0.388545 -0.256352 -0.263657 -0.232375 -0.236986 -0.770160 -0.530702 0.348145 0.235448 0.266918 0.273360 0.267667 0.267729 0.300532 0.231344 0.231419 0.230868 0.235122 0.234651 0.261378 0.262680 0.295546 0.271072 0.232417 0.250517 0.242254
chargesum: 0.00000
title: Mulliken charges with hydrogens summed into heavy atoms:
elementType: S O O O N N N C C C C C C C C C C C C C C C C C C C C C
charge: 0.966724 -0.319831 -0.543798 -0.553763 -0.133023 -0.032661 -0.206723 0.224099 0.243399 0.224797 -0.092188 -0.104997 0.271118 -0.149556 -0.073941 0.163790 0.261429 -0.004529 -0.039122 -0.039967 -0.100367 -0.157202 -0.024934 -0.032789 0.002747 -0.002335 0.059137 0.194485
polarizability: 6.34685379e+02 -4.91830755e+01 3.59270130e+02 -1.62588564e+01 8.61761425e+00 1.80488273e+02
1716.lowfreq: -6.7407 -4.4311 -0.0014 -0.0010 0.0010 1.0545 14.6726 16.3765 19.2507
frequency: 13.7814 16.2704 19.2427 40.3370 43.9295 49.1243 81.4966 92.6570 111.6861 112.6767 118.0240 138.4132 146.1036 156.7133 170.7029 180.1248 216.7014 232.7463 239.8630 247.3561 273.2638 275.8873 296.9575 310.6474 324.5390 364.5884 387.0191 394.7227 397.2021 405.4290 435.7172 451.4892 463.7165 475.5486 504.0313 524.4005 533.9349 539.0987 550.8481 578.9675 593.8424 595.9870 617.8385 633.6463 645.5031 659.2792 704.8106 712.2392 720.4288 747.1635 767.4971 772.9191 788.8183 800.3441 802.1800 810.3603 845.1815 856.1256 863.2197 867.8459 873.0700 880.7377 885.2963 925.6641 930.1155 931.8471 942.3796 966.6121 968.8928 994.8361 995.0369 996.2238 1001.6667 1018.3961 1021.8665 1074.6979 1109.6953 1118.0840 1121.8066 1152.3079 1154.5260 1161.5870 1171.5986 1178.4803 1182.9684 1219.7756 1228.9137 1251.1364 1276.3310 1283.4844 1284.8981 1293.3368 1319.2957 1351.9748 1369.4338 1386.3813 1396.8635 1409.5906 1415.8211 1426.7263 1436.0814 1441.3359 1452.9234 1455.2208 1467.9395 1468.1804 1478.1119 1484.1076 1514.3840 1524.8763 1548.1913 1550.1709 1571.8482 1605.1204 1611.4566 1631.2565 2978.7170 3027.7271 3074.8395 3128.7967 3129.3790 3132.9047 3136.1746 3141.5917 3147.7295 3157.7239 3164.7735 3171.7138 3172.4333 3173.5292 3178.0805 3181.8378 3190.7995 3328.5351 3479.4151
redmass: 6.0143 6.2266 5.8441 4.6890 5.0772 5.1654 4.6966 4.3459 5.1990 5.7433 3.9450 4.5747 2.4121 1.6641 4.6128 3.6648 1.8953 4.1572 4.1545 3.0607 3.5437 3.4038 4.3237 7.3913 5.8735 7.1387 4.9475 4.0111 4.6768 4.9287 4.8078 3.8955 4.4594 2.9812 3.2945 7.4787 8.3204 4.7715 4.8809 3.1769 2.8760 4.1163 4.1462 3.7203 2.7863 5.4179 5.1692 4.8777 3.8378 3.4086 1.6105 1.3711 3.4947 1.9396 3.4417 3.4983 1.6705 3.1194 1.7403 4.0012 1.5409 2.1896 2.1942 2.7024 3.4556 2.0252 1.3320 1.3580 1.3523 2.5120 1.3272 1.3309 3.2215 2.2755 2.0416 4.5463 2.0402 1.3616 1.7425 1.3337 1.3827 1.1877 1.1829 1.9693 1.2114 1.6569 1.6768 2.9643 1.1567 2.3133 1.7116 3.1322 2.6551 2.4984 2.2541 3.4748 3.0305 1.0583 1.0583 5.5378 1.5018 2.7025 2.5463 3.1138 1.1292 1.6776 1.4546 1.9657 4.1011 6.8190 6.6317 7.3986 3.6766 6.5878 5.7731 6.3898 1.0318 1.0238 1.1049 1.0896 1.0852 1.0858 1.1018 1.0893 1.0893 1.0953 1.0951 1.0949 1.0996 1.0995 1.1072 1.1080 1.0923 1.0753 1.0745
irintensity: 2.9242 3.0942 0.1097 2.0269 1.0916 2.4350 0.7923 30.5700 45.4942 32.2687 7.7779 0.8340 2.1912 4.0193 4.7133 28.2796 7.0701 5.5832 1.2990 3.8694 4.0398 10.7220 2.1515 15.5832 0.6024 41.5202 29.2524 13.3710 7.4018 34.4447 8.4552 5.4894 4.6403 2.9882 0.9088 1.2336 51.2778 18.3304 4.0773 23.3453 65.9325 30.2036 36.9953 48.1755 29.4519 0.8871 3.3604 20.9021 10.5438 3.4868 153.2496 6.8177 2.8561 101.2206 47.5110 12.1826 78.2044 14.3309 31.0130 5.3253 1.6544 2.8358 13.5411 2.2861 1.1126 12.8989 131.7721 1.1407 1.7255 36.9875 0.3949 0.2643 68.6615 3.7036 12.3824 7.8942 4.1588 21.3429 76.0850 3.4720 2.5328 1.3370 1.7130 68.3503 15.0939 23.8839 16.7192 9.9814 22.9551 19.6030 14.6025 18.8735 110.2572 98.3209 64.9516 91.5886 27.2357 5.0592 10.8921 179.5653 4.7603 21.3795 3.6639 10.5502 28.5968 88.1982 26.4822 107.9309 507.6616 37.3679 46.4576 46.3063 55.0704 354.6049 73.3591 6.6272 46.3748 0.9818 25.3756 7.3800 0.0342 4.5287 16.4935 12.5606 8.4241 19.7858 15.8848 8.4568 37.3300 19.6558 0.1888 1.6199 1.4051 12.6268 70.9537
temp: 298.150 k
press: 1.00000 atm
elementType: 16 8 8 8 7 7 7 6 6 6 6 6 6 6 6 6 6 6 6 6 6 6 6 6 6 6 6 6 1 1 1 1 1 1 1 1 1 1 1 1 1 1 1 1 1 1 1
symmnumber: 1
zpe: 931480.9 jmol-1
zpe.correction: 0.354782 hartree
zpe.thermalcorrener: 0.380804 hartree
zpe.thermalcorrenthalpy: 0.381748 hartree
zpe.thermalcorrgfe: 0.295723 hartree
zpe.sumelectzpe: -1597.480136 hartree
zpe.sumelectthermal: -1597.454114 hartree
zpe.sumelectthermalent: -1597.453170 hartree
zpe.sumelectthermalfe: -1597.539195 hartree
dipole: 4.4713 0.8711 0.9339
dipole: 4.6501
quadrupole: -226.4500 -141.3571 -171.3439
quadrupole: -22.0638 -6.2812 -4.5522
quadrupole: -46.7330 38.3599 8.3731 -22.0638 -6.2812 -4.5522
hfenergy: -1597.8349181 hartree
pointgroup: C01 [X(C21H19N3O3S1)]
dipole: 1.8035929 0.2672957 0.1503772 debye
polarizability: 617.4315001|-86.4584857|331.6608979|9.2711728|-80.2055075|225.3513838 unknown
InChI: InChI=1S/C20H16N3O.CH3O2S/c1-24-19-12-13(21)10-11-18(19)23-20-14-6-2-4-8-16(14)22-17-9-5-3-7-15(17)20;1-4(2)3/h2-12,21,23H,1H3;1H3
charge 0 multiplicity 1
47 atoms
S  -5.887453 0.967087 -0.500366
O  -1.418843 -0.99223 2.420332
O  -7.339389 0.860776 -1.23225
O  -5.749859 0.877768 1.124677
N  0.595977 -0.419942 0.842139
N  4.481857 0.38416 -0.835051
N  -4.657301 -0.592665 -1.241389
C  1.856137 -0.135107 0.258017
C  2.900779 -1.107433 0.382462
C  2.135591 1.112445 -0.385986
C  4.213298 -0.781945 -0.16681
C  3.471728 1.303573 -0.947586
C  -0.668432 -0.391468 0.244774
C  2.711065 -2.394695 0.996803
C  1.201776 2.205656 -0.451346
C  -1.785902 -0.719028 1.091508
C  -3.330503 -0.481866 -0.791519
C  -0.916597 -0.122055 -1.128319
C  5.283041 -1.734151 -0.025457
C  3.771873 2.537626 -1.626716
C  -3.086795 -0.778144 0.588234
C  -2.228542 -0.128589 -1.630364
C  3.769645 -3.293364 1.110503
C  1.538665 3.394296 -1.093205
C  5.071753 -2.955849 0.605779
C  2.828922 3.556476 -1.705987
C  -5.124053 2.68151 -0.986963
C  -2.496534 -1.31581 3.366278
H  0.592135 -0.826884 1.783817
H  1.716728 -2.684196 1.354161
H  0.222018 2.102306 0.023286
H  -0.077533 0.096905 -1.79373
H  6.256129 -1.452609 -0.438992
H  4.774467 2.636354 -2.053633
H  -3.94368 -1.039861 1.212618
H  -2.404774 0.100596 -2.688515
H  3.608382 -4.272033 1.575383
H  0.81961 4.220192 -1.124177
H  5.892836 -3.67367 0.707609
H  3.070636 4.494435 -2.217551
H  -4.750944 -0.445154 -2.268486
H  -5.253072 2.786857 -2.072848
H  -5.707633 3.421689 -0.421959
H  -4.070414 2.65678 -0.676291
H  -3.005839 -2.253401 3.075174
H  -3.23108 -0.491401 3.416265
H  -1.999777 -1.442139 4.338878
