program: Orca
programVersion: 5.0.2
elementType: O O N N C C C C C C C C C H H H H H H H H H H H H H H H H H H H H
charge: 0
multiplicity: 1
keywords: wb97x-d3
keywords: def2-TZVPP
keywords: def2/J RIJCOSX
keywords: DEFGRID2
keywords: scfconv7
keywords: smallprint printgap noloewdin
keywords: NOSOSCF
formula: C9H20N2O2
InChI: InChI=1/C9H20N2O2/c1-4-8-13-9(12)10-6-5-7-11(2)3/h10H,4-8H2,1-3H3
33 atoms
O  -1.91924 -0.497165 0.411083
O  -1.399709 1.689174 0.623051
N  3.134216 -0.897364 -0.279781
N  -0.06696 0.257101 -0.529449
C  2.006694 1.196922 0.471956
C  2.567971 -0.170196 0.84155
C  1.041847 1.168967 -0.707196
C  4.297398 -0.23929 -0.830439
C  3.445705 -2.258388 0.092142
C  -3.210541 -0.291317 0.990356
C  -4.233761 0.164838 -0.029888
C  -1.146533 0.575513 0.203103
C  -4.39743 -0.795076 -1.197435
H  1.498168 1.599472 1.352026
H  2.808961 1.903343 0.24336
H  1.760815 -0.779303 1.258632
H  3.301392 -0.041633 1.656998
H  0.652502 2.170271 -0.891801
H  1.561947 0.868982 -1.616075
H  0.088418 -0.714666 -0.748482
H  4.049004 0.752967 -1.207484
H  4.684569 -0.813199 -1.673865
H  5.117845 -0.122696 -0.103952
H  2.54941 -2.766819 0.452073
H  4.211061 -2.335258 0.880744
H  3.810879 -2.811879 -0.774829
H  -3.149695 0.406921 1.82645
H  -3.489396 -1.265168 1.394316
H  -5.184343 0.265567 0.50083
H  -3.983558 1.163702 -0.393588
H  -3.488485 -0.872903 -1.793961
H  -4.656164 -1.798127 -0.854637
H  -5.193088 -0.462994 -1.86456
elementType: O N C H
totalener: -615.06237029 hartree
nucrepener: 860.41199999 hartree
electener: -1475.47437027 hartree
oneelecener: -2542.64587781 hartree
twoeener: 1067.17150754 hartree
cpcmener: -0.01906249 hartree
kineticenergy: 612.22193139 hartree
xcener: -59.913896557938 hartree
chargesum: 0.0000000
charge: -0.339906 -0.540911 -0.243183 -0.237486 -0.115051 -0.105864 -0.066537 -0.191308 -0.190903 0.022996 -0.106130 0.511376 -0.261745 0.085046 0.080144 0.092961 0.088065 0.098729 0.105368 0.172664 0.094185 0.099695 0.078446 0.097086 0.074547 0.098524 0.100390 0.107419 0.073014 0.067905 0.080054 0.078245 0.092164
qa: -0.3399 -0.5409 -0.2432 -0.2375 -0.1151 -0.1059 -0.0665 -0.1913 -0.1909 0.0230 -0.1061 0.5114 -0.2617 0.0850 0.0801 0.0930 0.0881 0.0987 0.1054 0.1727 0.0942 0.0997 0.0784 0.0971 0.0745 0.0985 0.1004 0.1074 0.0730 0.0679 0.0801 0.0782 0.0922
va: 2.0540 1.9657 2.8701 3.1532 3.7864 3.8907 3.9168 3.9382 3.9284 3.8571 3.8683 4.3229 3.9246 1.0216 1.0112 1.0041 1.0136 1.0197 1.0069 1.0217 0.9941 0.9965 1.0047 0.9953 1.0017 0.9961 1.0191 0.9965 1.0135 1.0218 1.0097 1.0016 1.0044
dispcorr: -0.012534140 hartree
energy: -615.074904427674
dipole: 6.35559 -5.65984 0.69575 -4.95228 3.79713 -1.15515 -2.28525 2.04736 -0.23789
magnitude: 1.36932 au
magnitude: 3.48053 debye
