program: Orca
programVersion: 5.0.2
elementType: O O N N C C C C C C C C C H H H H H H H H H H H H H H H H H H H H
charge: 0
multiplicity: 1
keywords: wb97x-d3
keywords: def2-TZVPP
keywords: def2/J RIJCOSX
keywords: DEFGRID2
keywords: scfconv7
keywords: smallprint printgap noloewdin
keywords: NOSOSCF
formula: C9H20N2O2
InChI: InChI=1/C9H20N2O2/c1-4-8-13-9(12)10-6-5-7-11(2)3/h10H,4-8H2,1-3H3
33 atoms
O  -1.449616 -0.172053 -0.92126
O  -1.459777 1.877516 0.025657
N  2.410699 -0.941451 -0.078017
N  0.425544 0.984451 -0.896256
C  2.143286 1.378269 0.847671
C  3.072951 0.219493 0.504439
C  1.375899 1.929726 -0.349291
C  1.561782 -1.623109 0.87779
C  3.380165 -1.860663 -0.63627
C  -2.836941 -0.359775 -0.638051
C  -3.084294 -0.855698 0.773732
C  -0.869115 0.973826 -0.535889
C  -4.561565 -1.147319 0.991547
H  1.442159 1.108416 1.642106
H  2.76416 2.180575 1.255356
H  3.646265 -0.061087 1.404452
H  3.806015 0.579437 -0.223738
H  0.849843 2.842169 -0.073285
H  2.079597 2.204157 -1.139063
H  0.84155 0.095508 -1.15211
H  2.120825 -2.019947 1.739397
H  1.055993 -2.46065 0.394809
H  0.787549 -0.961371 1.266266
H  2.870567 -2.702655 -1.107544
H  4.075568 -2.269619 0.112904
H  3.974119 -1.363047 -1.404626
H  -3.167702 -1.107845 -1.36016
H  -3.398746 0.556075 -0.836301
H  -2.498276 -1.762394 0.946528
H  -2.745029 -0.113151 1.499404
H  -5.171474 -0.253135 0.849773
H  -4.926558 -1.908894 0.299701
H  -4.743798 -1.510574 2.003127
elementType: O N C H
totalener: -615.06234382 hartree
nucrepener: 879.76243072 hartree
electener: -1494.82477454 hartree
oneelecener: -2581.34094281 hartree
twoeener: 1086.51616827 hartree
cpcmener: -0.01833732 hartree
kineticenergy: 612.20948874 hartree
xcener: -59.911587249561 hartree
chargesum: -0.0000000
charge: -0.333966 -0.539884 -0.246362 -0.250890 -0.133357 -0.077012 -0.041080 -0.204787 -0.191037 0.033280 -0.094052 0.492935 -0.272219 0.079808 0.083589 0.081954 0.090264 0.095372 0.097566 0.177880 0.090236 0.106990 0.093536 0.099402 0.080382 0.098792 0.107510 0.087622 0.061512 0.067192 0.084521 0.081425 0.092877
qa: -0.3340 -0.5399 -0.2464 -0.2509 -0.1334 -0.0770 -0.0411 -0.2048 -0.1910 0.0333 -0.0941 0.4929 -0.2722 0.0798 0.0836 0.0820 0.0903 0.0954 0.0976 0.1779 0.0902 0.1070 0.0935 0.0994 0.0804 0.0988 0.1075 0.0876 0.0615 0.0672 0.0845 0.0814 0.0929
va: 2.0632 1.9675 2.8879 3.1292 3.8702 3.8820 3.8865 3.9189 3.9159 3.8468 3.8663 4.3346 3.9537 1.0092 1.0187 1.0135 1.0005 1.0288 1.0021 1.0635 1.0089 0.9962 0.9963 0.9962 1.0019 0.9981 0.9995 1.0162 1.0112 1.0232 1.0010 1.0017 1.0024
dispcorr: -0.013297909 hartree
energy: -615.075641724078
dipole: 3.50268 -2.28575 1.21693 -8.62335 7.33426 -1.28910 5.69636 -5.55335 0.14301
magnitude: 1.77852 au
magnitude: 4.52064 debye
