program: Gaussian 09
title: 000065966
version: EM64L-G09RevD.01
frameworkgroup: C1[X(C21H23NO5S)]
method: RPBEPBE
basis: SDD
operation: Freq
keyword: #p
keyword: freq=noraman
keyword: PBEPBE/SDD
title: #p freq=noraman PBEPBE/SDD
converged: YES YES NO NO
title: Mulliken charges:
elementType: S O O O O O N C C C C C C C C C C C C C C C C C C C C C H H H H H H H H H H H H H H H H H H H H H H H
charge: 0.861877 -0.265066 -0.468691 -0.301275 -0.532618 -0.538000 -0.177122 -0.302011 -0.077918 0.333842 0.304378 -0.355909 0.127205 -0.453240 0.245851 -0.533616 -0.741159 -0.741885 -0.396001 -0.367958 -0.133005 -0.229132 -0.042063 -0.265993 -0.247306 -0.210445 -0.205877 -0.218763 0.300923 0.212282 0.244296 0.249984 0.239727 0.235992 0.258892 0.249270 0.253944 0.220248 0.224235 0.258913 0.228857 0.233204 0.308191 0.380601 0.266459 0.281648 0.284944 0.279394 0.240116 0.241917 0.237860
chargesum: 0.00000
title: Mulliken charges with hydrogens summed into heavy atoms:
elementType: S O O O O O N C C C C C C C C C C C C C C C C C C C C C
charge: 0.861877 -0.265066 -0.088090 -0.301275 -0.532618 -0.538000 -0.177122 -0.001088 0.134364 0.333842 0.304378 0.138372 0.127205 0.022479 0.245851 -0.025453 -0.042732 -0.020910 -0.087809 -0.101499 -0.133005 0.052516 -0.042063 0.018951 0.032089 0.029671 0.036040 0.019097
polarizability: 3.29174465e+02 1.09480547e+01 2.78421398e+02 -2.21974781e+01 1.44812642e+01 2.05319799e+02
1716.lowfreq: -8.0183 -6.4639 -0.0003 0.0008 0.0013 1.0211 7.3369 20.2585 32.4499
frequency: 5.0582 19.9226 32.4337 37.1741 56.3992 66.2422 67.3638 98.3501 108.6025 135.1026 148.7967 152.1977 169.3679 177.3713 185.6991 191.8944 201.9049 223.8311 228.1030 234.5507 243.2938 264.8916 285.7523 305.5215 309.6068 325.8866 335.3997 374.7796 382.1192 404.0848 408.1322 424.7144 446.3995 461.3853 472.7228 490.8810 512.8793 518.0374 538.3257 560.9086 577.7543 603.1842 618.1476 626.2664 643.8171 656.7174 665.1552 680.1063 693.7060 722.9403 734.8688 763.9832 782.0679 793.1917 808.6337 843.2334 852.0675 852.7645 854.9033 888.8662 899.2678 923.1382 931.6350 932.5889 935.6237 937.8228 968.4796 970.6480 979.6610 983.2501 995.8732 1004.7148 1008.7426 1009.2901 1021.3987 1039.3945 1047.4013 1059.2945 1073.9824 1075.1955 1078.7640 1113.3967 1135.5144 1152.1386 1172.1837 1175.1162 1178.7350 1182.0827 1197.0590 1210.9202 1220.0167 1228.1931 1245.1169 1257.3248 1265.5753 1276.1250 1280.1188 1299.4209 1312.7756 1315.3592 1330.6778 1353.3058 1375.6082 1383.1240 1390.1620 1392.9567 1400.4667 1407.8170 1430.8790 1435.2608 1452.2644 1457.1307 1458.0224 1461.2746 1463.4039 1477.8518 1478.8936 1487.3942 1501.1533 1573.6187 1577.7527 1599.7426 1604.4836 1607.9496 2937.0203 2971.4044 2990.1442 2995.7959 2998.4856 3011.7414 3025.4682 3047.2434 3089.2607 3092.0959 3096.3810 3104.7367 3108.8777 3114.7277 3131.7145 3135.3077 3144.0973 3152.7113 3155.2154 3161.6173 3172.9307 3176.3788 3248.5159
redmass: 5.7086 5.6397 4.4373 4.8450 4.7129 4.2740 6.0724 4.4333 4.6322 4.3555 5.0603 2.0317 3.8535 3.2372 1.3934 3.1554 3.8786 3.5510 2.0721 2.0741 8.7450 6.9585 3.4134 5.1488 4.3872 4.0391 5.0849 6.5331 7.8193 2.8399 6.5777 4.2241 4.0808 5.8624 3.8248 3.7679 4.2583 4.4927 3.4517 2.6820 3.2253 6.4747 5.1832 1.5519 3.4327 5.1656 4.3983 6.6100 2.2673 4.1548 3.3916 1.5451 6.4342 3.3864 3.7017 1.4945 3.7182 2.0985 1.3315 2.6528 1.8434 14.8930 2.2857 1.3955 1.4933 1.4041 1.3577 1.9769 5.1041 1.4094 2.3156 1.3518 3.8563 2.0832 3.9490 2.5572 2.1677 2.4825 1.7877 1.6280 2.4608 1.8421 1.7744 1.4082 1.0703 1.1488 2.0696 2.2547 1.3422 1.9358 1.9982 1.3601 2.7754 2.6416 1.3484 1.6606 1.4901 1.3117 1.3420 1.3187 1.4986 1.3277 1.2527 8.2040 1.7503 2.6918 2.8034 3.5455 1.4145 2.2536 2.0612 1.0904 1.0935 2.4604 1.0526 1.0724 1.0946 1.0646 1.1097 7.4761 5.8362 8.9581 7.1453 7.6755 1.0830 1.0824 1.0602 1.0357 1.0363 1.0662 1.0670 1.0997 1.0994 1.1001 1.0998 1.1013 1.0999 1.0994 1.0916 1.0856 1.0882 1.0922 1.0889 1.0967 1.1015 1.0967 1.0706
irintensity: 0.5056 0.8296 0.3526 0.3676 4.1098 1.2046 3.6533 0.9157 1.0342 4.5682 2.2195 1.6691 0.4450 1.9302 0.3302 2.6688 7.0367 4.1520 2.5831 2.8106 6.3319 3.6925 6.3455 12.9835 0.2076 2.0940 7.2914 5.7725 10.0194 0.0112 3.1907 15.3944 18.0629 45.2852 0.9213 27.4507 47.2164 92.7831 10.2750 18.5286 17.8943 0.0079 15.5595 74.6908 16.5097 20.0149 9.6178 5.5244 41.3146 1.5426 3.2940 83.5948 48.5845 14.7972 21.1020 26.2414 14.1704 4.4893 6.0122 27.0591 23.2581 68.0279 5.3251 3.4449 2.7991 8.3235 0.7007 3.7984 2.2840 0.0591 53.8674 0.3389 1.2520 8.5888 52.2027 4.0982 29.4764 16.3747 9.2636 1.2388 14.4025 110.2824 87.5135 6.7776 0.8904 5.1982 7.2439 15.0840 0.7012 53.6846 23.5269 22.6221 127.5192 8.9534 9.5504 95.0697 21.5891 4.7726 8.1441 10.4925 1.4567 6.5933 36.4108 5.9182 0.9824 44.1181 78.9261 5.7549 142.0141 13.9851 26.1659 6.8605 14.8348 105.8478 0.3669 16.5620 13.6004 11.1619 4.5472 38.4067 6.3351 283.7792 18.4421 24.3519 34.1810 11.0999 48.1969 17.0982 12.2693 12.8390 21.3810 17.7432 22.6915 14.4635 34.7413 22.5475 3.6073 13.0784 3.1408 0.9914 7.2424 1.4986 2.5276 6.1485 29.7216 3.2525 292.8659
temp: 298.150 k
press: 1.00000 atm
elementType: 16 8 8 8 8 8 7 6 6 6 6 6 6 6 6 6 6 6 6 6 6 6 6 6 6 6 6 6 1 1 1 1 1 1 1 1 1 1 1 1 1 1 1 1 1 1 1 1 1 1 1
symmnumber: 1
zpe: 1049871.8 jmol-1
zpe.correction: 0.399875 hartree
zpe.thermalcorrener: 0.426286 hartree
zpe.thermalcorrenthalpy: 0.427230 hartree
zpe.thermalcorrgfe: 0.341025 hartree
zpe.sumelectzpe: -1640.767011 hartree
zpe.sumelectthermal: -1640.740600 hartree
zpe.sumelectthermalent: -1640.739656 hartree
zpe.sumelectthermalfe: -1640.825861 hartree
dipole: 1.5194 3.6721 -6.9591
dipole: 8.0138
quadrupole: -186.3491 -160.2866 -183.5524
quadrupole: 21.5894 -17.2564 -0.6604
quadrupole: -9.6198 16.4428 -6.8230 21.5894 -17.2564 -0.6604
hfenergy: -1641.1668864 hartree
pointgroup: C01 [X(C21H23N1O5S1)]
dipole: 0.6889929 1.1904535 -2.837046 debye
polarizability: 330.4565825|6.7027226|279.5326513|-21.0128309|9.5653166|202.9264283 unknown
InChI: InChI=1S/C21H23NO5S/c1-21(2)20(24)19(22-12-6-9-18(22)23)16-13-15(10-11-17(16)27-21)28(25,26)14-7-4-3-5-8-14/h3-5,7-8,10-11,13,19-20,24H,6,9,12H2,1-2H3
charge 0 multiplicity 1
51 atoms
S  2.781002 -1.161008 1.380003
O  -2.661325 -2.191308 -1.054979
O  -4.711066 0.732636 0.075503
O  -3.353059 2.874679 1.269452
O  3.45909 -2.641008 1.56056
O  2.53802 -0.113512 2.618361
N  -1.77528 1.748089 -0.05602
C  -2.260221 0.393561 0.328908
C  -3.548695 0.041494 -0.468306
C  -3.861138 -1.480125 -0.448797
C  -1.167488 -0.659255 0.184455
C  -0.731654 2.035914 -1.070876
C  -1.418077 -1.877106 -0.512427
C  -0.886178 3.567005 -1.316307
C  -2.347674 2.885072 0.484954
C  -1.58707 4.101808 -0.038451
C  -5.014917 -1.806143 -1.397983
C  -4.099834 -2.02574 0.969782
C  0.110689 -0.460561 0.75537
C  -0.39413 -2.844644 -0.685333
C  1.101907 -1.430238 0.564723
C  0.884951 -2.625285 -0.14565
C  3.837168 -0.229816 0.100103
C  3.874685 1.170967 0.179231
C  4.585562 -0.984701 -0.816156
C  4.693032 1.858181 -0.748141
C  5.396419 -0.280205 -1.737004
C  5.443423 1.134077 -1.705302
H  -2.554984 0.480077 1.397015
H  -3.392371 0.336881 -1.530115
H  -0.900504 1.439229 -1.985271
H  0.27364 1.779465 -0.687372
H  -1.530322 3.742127 -2.195462
H  0.087229 4.046734 -1.506853
H  -2.278234 4.938227 -0.224618
H  -0.862652 4.429968 0.730912
H  -5.914251 -1.255673 -1.076425
H  -4.766487 -1.50362 -2.430212
H  -5.226763 -2.889071 -1.391774
H  -4.947437 -1.48479 1.422264
H  -4.339931 -3.101429 0.92532
H  -3.2185 -1.896383 1.62257
H  0.321683 0.426453 1.364656
H  -4.414445 1.51862 0.630848
H  -0.635227 -3.766131 -1.222676
H  1.680096 -3.37325 -0.22732
H  3.31462 1.692077 0.963311
H  4.55806 -2.079052 -0.787102
H  4.755203 2.951008 -0.713225
H  5.996251 -0.834364 -2.466443
H  6.079085 1.671969 -2.417099
