program: Orca
programVersion: 5.0.2
elementType: O O N N C C C C C C C C C H H H H H H H H H H H H H H H H H H H H
charge: 0
multiplicity: 1
keywords: wb97x-d3
keywords: def2-TZVPP
keywords: def2/J RIJCOSX
keywords: DEFGRID2
keywords: scfconv7
keywords: smallprint printgap noloewdin
keywords: NOSOSCF
formula: C9H20N2O2
InChI: InChI=1/C9H20N2O2/c1-4-8-13-9(12)10-6-5-7-11(2)3/h10H,4-8H2,1-3H3
33 atoms
O  -1.780345 -0.130393 0.275554
O  -1.160284 2.014509 -0.044317
N  2.877019 -0.970717 0.049865
N  0.238885 0.502151 0.919149
C  2.190597 1.38906 -0.343947
C  2.4353 0.003233 -0.930116
C  1.397275 1.358095 0.961154
C  4.183413 -0.668011 0.586396
C  2.83236 -2.313179 -0.480902
C  -3.060189 0.144094 -0.27947
C  -3.88368 -1.124955 -0.206302
C  -0.918282 0.897404 0.343662
C  -5.274532 -0.915325 -0.788213
H  3.13194 1.91696 -0.167653
H  1.650309 1.979955 -1.086472
H  3.139088 0.08506 -1.776959
H  1.497274 -0.362998 -1.355308
H  2.027206 1.002057 1.776332
H  1.082338 2.367266 1.225072
H  0.396523 -0.480881 1.066396
H  4.455028 -1.407312 1.340942
H  4.189053 0.306577 1.074601
H  4.976752 -0.662871 -0.178256
H  3.518901 -2.475539 -1.32705
H  1.823664 -2.547741 -0.82416
H  3.091151 -3.032687 0.297349
H  -2.96157 0.478852 -1.316652
H  -3.550665 0.950937 0.272521
H  -3.37218 -1.925866 -0.745699
H  -3.961476 -1.448571 0.834483
H  -5.820014 -0.137583 -0.251744
H  -5.229771 -0.620374 -1.837539
H  -5.865757 -1.828171 -0.729918
totalener: -615.04654242 hartree
nucrepener: 857.10358505 hartree
electener: -1472.15012747 hartree
oneelecener: -2535.71579822 hartree
twoeener: 1063.56567075 hartree
kineticenergy: 612.24745100 hartree
xcener: -59.914343103629 hartree
chargesum: -0.0000000
charge: -0.314388 -0.425584 -0.230740 -0.236074 -0.134493 -0.118172 -0.057323 -0.175919 -0.173230 0.036296 -0.077315 0.446767 -0.256018 0.072950 0.098270 0.087098 0.093734 0.094264 0.103575 0.149210 0.090787 0.080936 0.076799 0.075318 0.086348 0.089510 0.080953 0.081115 0.056520 0.060235 0.076323 0.075363 0.086883
qa: -0.3144 -0.4256 -0.2307 -0.2361 -0.1345 -0.1182 -0.0573 -0.1759 -0.1732 0.0363 -0.0773 0.4468 -0.2560 0.0730 0.0983 0.0871 0.0937 0.0943 0.1036 0.1492 0.0908 0.0809 0.0768 0.0753 0.0863 0.0895 0.0810 0.0811 0.0565 0.0602 0.0763 0.0754 0.0869
va: 2.0712 2.0895 2.8693 3.1301 3.7620 3.9135 3.9341 3.9511 3.9347 3.8883 3.9005 4.3671 3.9505 1.0112 1.0197 1.0151 1.0012 1.0051 1.0199 1.0459 0.9994 1.0004 1.0054 1.0035 0.9995 0.9987 1.0021 1.0036 1.0113 1.0112 1.0041 1.0041 1.0054
dispcorr: -0.012197204 hartree
energy: -615.058739627702
dipole: 3.96317 -3.41027 0.55290 -7.42331 6.43419 -0.98912 -3.45840 3.44108 -0.01733
magnitude: 1.13329 au
magnitude: 2.88060 debye
