program: Orca
programVersion: 5.0.2
elementType: O O N N C C C C C C C C C H H H H H H H H H H H H H H H H H H H H
charge: 0
multiplicity: 1
keywords: wb97x-d3
keywords: def2-TZVPP
keywords: def2/J RIJCOSX
keywords: DEFGRID2
keywords: scfconv7
keywords: smallprint printgap noloewdin
keywords: NOSOSCF
formula: C9H20N2O2
InChI: InChI=1/C9H20N2O2/c1-4-8-13-9(12)10-6-5-7-11(2)3/h10H,4-8H2,1-3H3
33 atoms
O  -1.730072 0.222391 0.445569
O  -1.251258 2.3000 -0.286339
N  2.228471 -1.086082 0.130009
N  0.302228 1.015354 0.78331
C  2.331925 1.307291 -0.615979
C  3.080898 0.031878 -0.244912
C  1.44366 1.849409 0.500749
C  1.476476 -1.606098 -0.991829
C  2.992443 -2.134296 0.769236
C  -3.065075 0.349929 -0.027014
C  -3.763726 -0.976642 0.185862
C  -0.916179 1.275919 0.258538
C  -3.135731 -2.129921 -0.584451
H  3.083856 2.063078 -0.859795
H  1.738455 1.177768 -1.524643
H  3.72175 0.257484 0.613251
H  3.760766 -0.24546 -1.069668
H  2.034712 1.958197 1.415121
H  1.081909 2.842762 0.240834
H  0.520573 0.062187 1.037183
H  2.119067 -1.984827 -1.802131
H  0.823462 -0.842192 -1.411753
H  0.837545 -2.426113 -0.661438
H  3.759658 -2.577163 0.11496
H  2.328039 -2.937027 1.091315
H  3.494553 -1.746009 1.65613
H  -3.070025 0.618446 -1.087569
H  -3.581802 1.149025 0.511561
H  -3.794181 -1.208759 1.253499
H  -4.803472 -0.847917 -0.126497
H  -3.112907 -1.923107 -1.655926
H  -2.112325 -2.317194 -0.261389
H  -3.701355 -3.050273 -0.440167
totalener: -615.04733096 hartree
nucrepener: 880.60553462 hartree
electener: -1495.65286558 hartree
oneelecener: -2582.72497788 hartree
twoeener: 1087.07211230 hartree
kineticenergy: 612.24289202 hartree
xcener: -59.913398509858 hartree
chargesum: -0.0000000
charge: -0.315440 -0.426560 -0.238313 -0.250152 -0.145520 -0.083234 -0.035441 -0.188881 -0.172846 0.020920 -0.097220 0.443726 -0.237847 0.076532 0.081838 0.079681 0.078137 0.084986 0.103164 0.162870 0.086205 0.092474 0.094584 0.076701 0.089835 0.089290 0.085335 0.094430 0.060550 0.057573 0.070005 0.077513 0.085106
qa: -0.3154 -0.4266 -0.2383 -0.2502 -0.1455 -0.0832 -0.0354 -0.1889 -0.1728 0.0209 -0.0972 0.4437 -0.2378 0.0765 0.0818 0.0797 0.0781 0.0850 0.1032 0.1629 0.0862 0.0925 0.0946 0.0767 0.0898 0.0893 0.0853 0.0944 0.0605 0.0576 0.0700 0.0775 0.0851
va: 2.0594 2.0927 2.8821 3.1187 3.8696 3.8916 3.8917 3.9271 3.9315 3.8850 3.9309 4.3629 3.9190 1.0209 1.0114 1.0019 1.0151 1.0016 1.0313 1.0640 1.0093 1.0035 0.9962 1.0023 0.9997 1.0008 1.0039 1.0053 1.0134 1.0126 1.0058 1.0101 1.0075
dispcorr: -0.013225326 hartree
energy: -615.060556288300
dipole: 4.95489 -4.22944 0.72546 -11.48730 10.40604 -1.08126 -3.11026 3.16267 0.05241
magnitude: 1.30313 au
magnitude: 3.31230 debye
