program: Orca
programVersion: 5.0.2
elementType: O O N N C C C C C C C C C H H H H H H H H H H H H H H H H H H H H
charge: 0
multiplicity: 1
keywords: wb97x-d3
keywords: def2-TZVPP
keywords: def2/J RIJCOSX
keywords: DEFGRID2
keywords: scfconv7
keywords: smallprint printgap noloewdin
keywords: NOSOSCF
formula: C9H20N2O2
InChI: InChI=1/C9H20N2O2/c1-4-8-13-9(12)10-6-5-7-11(2)3/h10H,4-8H2,1-3H3
33 atoms
O  -2.346205 1.263049 0.181054
O  -0.975285 -0.461214 0.682653
N  3.399227 -0.760702 0.341621
N  -0.165295 1.619362 0.262181
C  1.777605 0.631429 -0.924719
C  3.211075 0.141656 -0.774723
C  1.228993 1.252449 0.355597
C  4.795052 -1.065357 0.534876
C  2.603496 -1.963351 0.241051
C  -3.489018 0.422614 0.300128
C  -3.74375 -0.414925 -0.939834
C  -1.14612 0.700677 0.396412
C  -5.020188 -1.23165 -0.791267
H  1.751026 1.365254 -1.73529
H  1.123754 -0.185313 -1.237134
H  3.865182 1.005414 -0.61488
H  3.531695 -0.312761 -1.730269
H  1.360137 0.565956 1.190397
H  1.794964 2.151519 0.609033
H  -0.414583 2.53757 -0.060584
H  5.363869 -0.146461 0.686929
H  5.250795 -1.60376 -0.312712
H  4.923621 -1.681949 1.425441
H  2.806313 -2.605167 1.098975
H  2.811289 -2.548832 -0.669974
H  1.538099 -1.73458 0.262744
H  -4.322023 1.107944 0.467396
H  -3.402282 -0.218185 1.180913
H  -3.81883 0.239611 -1.81194
H  -2.898219 -1.082912 -1.110449
H  -4.955872 -1.920147 0.052538
H  -5.89145 -0.594046 -0.631698
H  -5.210393 -1.826872 -1.683501
totalener: -615.04561226 hartree
nucrepener: 849.66356108 hartree
electener: -1464.70917334 hartree
oneelecener: -2521.08054589 hartree
twoeener: 1056.37137255 hartree
kineticenergy: 612.23779212 hartree
xcener: -59.913004802656 hartree
chargesum: -0.0000000
charge: -0.320835 -0.443582 -0.208872 -0.239986 -0.126832 -0.091960 -0.044134 -0.178302 -0.175877 0.031403 -0.103086 0.480020 -0.259174 0.069321 0.083249 0.073699 0.073270 0.107808 0.082790 0.138435 0.083901 0.066684 0.087825 0.083021 0.069622 0.104899 0.093707 0.087003 0.057626 0.077971 0.082526 0.071311 0.086550
qa: -0.3208 -0.4436 -0.2089 -0.2400 -0.1268 -0.0920 -0.0441 -0.1783 -0.1759 0.0314 -0.1031 0.4800 -0.2592 0.0693 0.0832 0.0737 0.0733 0.1078 0.0828 0.1384 0.0839 0.0667 0.0878 0.0830 0.0696 0.1049 0.0937 0.0870 0.0576 0.0780 0.0825 0.0713 0.0865
va: 2.0854 2.0538 2.8919 3.1614 3.8267 3.9276 3.8562 3.9554 3.9297 3.8963 3.8585 4.3085 3.9507 1.0201 1.0185 0.9990 1.0109 1.0339 1.0073 1.0408 0.9995 1.0019 0.9999 1.0019 1.0041 1.0083 0.9992 1.0151 1.0110 1.0235 1.0027 1.0038 1.0048
dispcorr: -0.012041271 hartree
energy: -615.057653528525
dipole: 4.85245 -4.81386 0.03859 -6.90573 7.57453 0.66880 -4.15904 3.65103 -0.50801
magnitude: 0.84075 au
magnitude: 2.13701 debye
