program: Orca
programVersion: 5.0.2
elementType: O O N N C C C C C C C C C H H H H H H H H H H H H H H H H H H H H
charge: 0
multiplicity: 1
keywords: wb97x-d3
keywords: def2-TZVPP
keywords: def2/J RIJCOSX
keywords: DEFGRID2
keywords: scfconv7
keywords: smallprint printgap noloewdin
keywords: NOSOSCF
formula: C9H20N2O2
InChI: InChI=1/C9H20N2O2/c1-4-8-13-9(12)10-6-5-7-11(2)3/h10H,4-8H2,1-3H3
33 atoms
O  -2.290217 1.185637 -0.445778
O  -0.955374 -0.622007 -0.21292
N  3.405969 -0.810559 0.524619
N  -0.21975 1.469922 0.279706
C  2.020495 0.898463 -0.629174
C  3.413809 0.395033 -0.276825
C  1.133409 1.075597 0.598258
C  4.730762 -1.139537 0.988146
C  2.783223 -1.930823 -0.143639
C  -3.380793 0.359847 -0.83901
C  -4.120985 -0.23581 0.344689
C  -1.137432 0.570234 -0.135838
C  -5.336687 -1.030243 -0.113084
H  2.125662 1.852177 -1.154208
H  1.531746 0.220243 -1.33144
H  3.934684 1.169448 0.296115
H  3.991416 0.26467 -1.21044
H  1.106562 0.152867 1.175393
H  1.55597 1.835802 1.258856
H  -0.446244 2.446384 0.211585
H  4.6907 -2.000998 1.656237
H  5.149266 -0.305301 1.553731
H  5.437513 -1.379686 0.176514
H  1.730786 -1.73314 -0.34686
H  2.820888 -2.807367 0.503993
H  3.273083 -2.197607 -1.094776
H  -3.041185 -0.430049 -1.513149
H  -4.042796 1.01907 -1.403478
H  -3.447685 -0.883911 0.908093
H  -4.432381 0.567035 1.017715
H  -5.872989 -1.44977 0.737121
H  -6.040014 -0.406953 -0.668124
H  -5.049784 -1.860693 -0.759753
totalener: -615.04586489 hartree
nucrepener: 845.97458378 hartree
electener: -1461.02044867 hartree
oneelecener: -2513.71948331 hartree
twoeener: 1052.69903464 hartree
kineticenergy: 612.23713979 hartree
xcener: -59.912786925341 hartree
chargesum: -0.0000000
charge: -0.321601 -0.443500 -0.210116 -0.240659 -0.126734 -0.091232 -0.042722 -0.177616 -0.174674 0.035827 -0.101822 0.477277 -0.259397 0.067778 0.084672 0.074126 0.073367 0.106202 0.083562 0.138534 0.087899 0.083954 0.066630 0.102961 0.083283 0.070509 0.084837 0.092521 0.078321 0.057890 0.086867 0.071017 0.082040
qa: -0.3216 -0.4435 -0.2101 -0.2407 -0.1267 -0.0912 -0.0427 -0.1776 -0.1747 0.0358 -0.1018 0.4773 -0.2594 0.0678 0.0847 0.0741 0.0734 0.1062 0.0836 0.1385 0.0879 0.0840 0.0666 0.1030 0.0833 0.0705 0.0848 0.0925 0.0783 0.0579 0.0869 0.0710 0.0820
va: 2.0852 2.0551 2.8918 3.1567 3.8238 3.9267 3.8540 3.9550 3.9303 3.8910 3.8628 4.3122 3.9499 1.0210 1.0197 0.9991 1.0113 1.0347 1.0075 1.0404 0.9996 0.9996 1.0018 1.0080 1.0014 1.0042 1.0176 0.9990 1.0228 1.0115 1.0049 1.0034 1.0028
dispcorr: -0.011938840 hartree
energy: -615.057803728475
dipole: 4.73814 -4.66791 0.07023 -5.53133 6.31094 0.77961 0.18070 -0.24237 -0.06167
magnitude: 0.78519 au
magnitude: 1.99579 debye
