program: Orca
programVersion: 5.0.2
elementType: O O N N C C C C C C C C C H H H H H H H H H H H H H H H H H H H H
charge: 0
multiplicity: 1
keywords: wb97x-d3
keywords: def2-TZVPP
keywords: def2/J RIJCOSX
keywords: DEFGRID2
keywords: scfconv7
keywords: smallprint printgap noloewdin
keywords: NOSOSCF
formula: C9H20N2O2
InChI: InChI=1/C9H20N2O2/c1-4-8-13-9(12)10-6-5-7-11(2)3/h10H,4-8H2,1-3H3
33 atoms
O  -1.860473 -0.174189 0.976649
O  -1.444867 1.97525 0.415183
N  2.60904 -0.863403 -0.147207
N  0.200175 0.600523 1.169511
C  1.792834 1.452545 -0.542163
C  1.946254 0.032497 -1.075397
C  1.295474 1.49812 0.902318
C  3.9963 -0.519945 0.062269
C  2.470949 -2.243745 -0.548898
C  -3.229412 -0.032073 0.613759
C  -3.462312 -0.166367 -0.880713
C  -1.067314 0.89824 0.810063
C  -2.941998 -1.47119 -1.466808
H  2.734659 2.004527 -0.605426
H  1.090924 1.982753 -1.189464
H  2.452692 0.061269 -2.055895
H  0.949149 -0.373611 -1.266692
H  2.100294 1.229355 1.586277
H  0.992038 2.513321 1.156034
H  0.439967 -0.362639 1.337455
H  4.603615 -0.587991 -0.854615
H  4.43714 -1.188567 0.802899
H  4.092556 0.495138 0.447772
H  2.910351 -2.898572 0.205033
H  2.953996 -2.47321 -1.512026
H  1.415239 -2.505278 -0.637275
H  -3.625739 0.918057 0.977295
H  -3.740125 -0.836511 1.146303
H  -4.541716 -0.094648 -1.043266
H  -3.021794 0.687474 -1.398272
H  -1.859261 -1.553969 -1.370432
H  -3.38326 -2.3368 -0.969616
H  -3.181264 -1.545042 -2.527473
totalener: -615.04593315 hartree
nucrepener: 883.93524661 hartree
electener: -1498.98117976 hartree
oneelecener: -2589.39645127 hartree
twoeener: 1090.41527151 hartree
kineticenergy: 612.24916502 hartree
xcener: -59.915602750594 hartree
chargesum: 0.0000000
charge: -0.320245 -0.430037 -0.233767 -0.228628 -0.136168 -0.116115 -0.057999 -0.176723 -0.171197 0.018928 -0.125553 0.448601 -0.234199 0.074442 0.098211 0.087496 0.092048 0.093047 0.103815 0.149835 0.076654 0.091530 0.081456 0.090585 0.076420 0.084162 0.099527 0.093647 0.063750 0.082435 0.067654 0.069676 0.086712
qa: -0.3202 -0.4300 -0.2338 -0.2286 -0.1362 -0.1161 -0.0580 -0.1767 -0.1712 0.0189 -0.1256 0.4486 -0.2342 0.0744 0.0982 0.0875 0.0920 0.0930 0.1038 0.1498 0.0767 0.0915 0.0815 0.0906 0.0764 0.0842 0.0995 0.0936 0.0638 0.0824 0.0677 0.0697 0.0867
va: 2.0618 2.0812 2.8653 3.1355 3.7519 3.9266 3.9384 3.9518 3.9348 3.8999 3.8706 4.3726 3.9319 1.0112 1.0193 1.0159 0.9962 1.0055 1.0198 1.0465 1.0053 0.9993 1.0005 0.9987 1.0035 0.9986 1.0168 0.9954 1.0148 1.0210 1.0098 1.0053 1.0063
dispcorr: -0.013513569 hartree
energy: -615.059446715873
dipole: 6.90644 -6.27015 0.63628 -7.57234 6.69377 -0.87857 -7.58668 7.38944 -0.19724
magnitude: 1.10256 au
magnitude: 2.80248 debye
