program: Gaussian 09
title: 000065891
version: EM64L-G09RevD.01
frameworkgroup: C1[X(C10H19Cl2NO5)]
method: RPBEPBE
basis: SDD
operation: Freq
keyword: #p
keyword: freq=noraman
keyword: PBEPBE/SDD
title: #p freq=noraman PBEPBE/SDD
converged: YES YES NO NO
title: Mulliken charges:
elementType: Cl Cl O O O O O N C C C C C C C C C C H H H H H H H H H H H H H H H H H H H
charge: -0.072802 -0.080872 -0.263176 -0.434020 -0.424987 -0.459576 -0.426891 -0.115170 -0.083423 -0.089513 -0.093306 -0.138339 -0.460545 -0.101327 -0.330018 -0.331581 -0.576127 -0.585149 0.207438 0.257572 0.195472 0.246788 0.234702 0.242971 0.202426 0.231822 0.237889 0.232357 0.233368 0.341979 0.359166 0.367560 0.369858 0.261113 0.269423 0.252767 0.322151
chargesum: 0.00000
title: Mulliken charges with hydrogens summed into heavy atoms:
elementType: Cl Cl O O O O O N C C C C C C C C C C
charge: -0.072802 -0.080872 -0.263176 -0.092041 -0.065820 -0.092016 -0.057033 -0.115170 0.124014 0.168059 0.102166 0.108449 0.017128 0.101099 0.139693 0.134144 -0.045592 -0.010231
polarizability: 1.72876686e+02 -5.27655576e+00 1.61365102e+02 3.34539956e+00 -4.35479155e-01 1.25766694e+02
1716.lowfreq: -7.3363 -5.7806 -0.0020 -0.0014 -0.0012 9.4600 23.2468 26.3770 31.6286
frequency: 22.6413 26.0152 31.5275 38.3792 70.5784 90.3552 94.6119 110.8814 120.5565 129.4794 172.4167 195.9830 197.1277 210.8869 237.6526 246.2419 258.4182 268.7434 305.4561 324.8189 343.1505 363.2320 400.5734 407.6810 419.5219 428.2865 445.0709 452.5886 461.7467 500.3278 549.8649 575.6389 639.4736 662.0577 669.9451 720.5709 772.3094 787.8513 808.5315 835.9927 877.5419 933.0915 955.2711 968.5308 997.0976 1000.3746 1007.5078 1017.4189 1034.7268 1046.7091 1056.7206 1061.1482 1071.7847 1080.1529 1099.9779 1109.6268 1134.8255 1172.4350 1192.3067 1204.5571 1208.5115 1231.6327 1240.5403 1243.9969 1252.4860 1267.6662 1277.8670 1283.3066 1296.2271 1304.0529 1312.1212 1322.2897 1330.0311 1344.2630 1363.0129 1371.9828 1379.7645 1382.6436 1388.5236 1395.0042 1407.9085 1451.5393 1462.4837 1469.1110 1475.6634 1479.6376 2911.7077 2924.5592 2940.8903 2944.2278 2947.9927 2950.3077 2996.3315 3043.7463 3050.7232 3054.2774 3059.3470 3064.8798 3084.1973 3143.4429 3146.3875 3516.8152 3537.1483 3573.9363 3576.6751
redmass: 8.9831 7.4527 8.1890 9.4519 5.1951 2.3847 5.1133 3.8986 4.3211 3.5935 4.0011 5.7417 4.7957 4.7509 3.8361 4.1329 4.7681 3.9228 3.1020 2.0687 2.8141 2.6178 1.5031 1.3340 2.0697 3.0235 1.3838 3.7511 2.5243 3.7518 3.6683 5.5972 3.6953 6.0488 5.8583 4.0201 1.1269 1.1414 3.6554 4.8849 2.8926 4.4956 2.8969 5.3556 2.0982 2.5348 1.5354 2.8214 3.0427 2.7539 3.0659 3.3611 3.0229 2.5993 1.9808 1.8881 1.5635 1.1640 1.4758 1.1999 1.4661 1.4219 1.3231 1.3606 1.2862 1.2243 1.2129 1.2438 1.3032 1.3018 1.3695 1.2632 1.3424 1.4903 1.3454 1.3478 1.4074 1.2960 1.4339 1.3743 1.5551 1.0909 1.0802 1.0856 1.0845 1.0901 1.0817 1.0837 1.0704 1.0674 1.0767 1.0708 1.0847 1.0948 1.0947 1.0578 1.0570 1.0934 1.0864 1.1128 1.1121 1.0651 1.0654 1.0658 1.0661
irintensity: 0.6780 1.3599 1.2393 0.1267 0.6250 2.2280 1.4707 0.9573 4.7471 3.3097 2.5752 0.8116 7.7056 12.3586 2.2630 12.8540 2.0897 9.7423 7.1827 61.7190 25.9617 15.7490 88.2439 128.9829 40.8255 11.4733 218.5808 9.2225 42.9536 51.5012 10.6853 13.2185 45.0278 66.5343 112.9692 1.7817 6.4925 5.2583 42.3324 14.9804 41.5891 70.0469 133.0266 63.3286 61.2017 30.5011 29.6301 127.9704 41.1478 64.1474 6.1118 4.2072 18.2220 14.1394 17.7220 96.2136 24.5356 43.9811 32.3321 26.2218 16.8383 10.5984 31.0800 18.7371 19.0862 14.5107 20.0222 15.3233 24.0304 14.0889 11.9940 20.1365 26.4999 0.4792 1.9625 1.4794 5.7609 11.9294 6.9457 20.7039 2.8605 3.7810 7.7225 3.9998 13.5639 12.0119 14.6884 47.5519 41.4431 39.5502 36.0426 100.2822 41.0437 5.9712 31.2531 7.1573 19.5458 15.5421 16.2385 13.2619 17.9645 6.5929 18.1871 13.3068 29.3648
temp: 298.150 k
press: 1.00000 atm
elementType: 17 17 8 8 8 8 8 7 6 6 6 6 6 6 6 6 6 6 1 1 1 1 1 1 1 1 1 1 1 1 1 1 1 1 1 1 1
symmnumber: 1
zpe: 776549.0 jmol-1
zpe.correction: 0.295772 hartree
zpe.thermalcorrener: 0.316489 hartree
zpe.thermalcorrenthalpy: 0.317433 hartree
zpe.thermalcorrgfe: 0.243823 hartree
zpe.sumelectzpe: -1741.936150 hartree
zpe.sumelectthermal: -1741.915433 hartree
zpe.sumelectthermalent: -1741.914489 hartree
zpe.sumelectthermalfe: -1741.988099 hartree
dipole: -3.7989 3.2842 -3.2244
dipole: 5.9678
quadrupole: -120.9181 -143.8807 -121.6630
quadrupole: -3.8440 2.5975 -0.8924
quadrupole: 7.9025 -15.0601 7.1576 -3.8440 2.5975 -0.8924
hfenergy: -1742.2319221 hartree
pointgroup: C01 [X(C10H19Cl2N1O5)]
dipole: -1.4592859 -0.5341032 1.7600705 debye
polarizability: 172.6249334|1.4351186|154.4453923|-8.0759512|-13.4330087|132.938156 unknown
InChI: InChI=1S/C10H19Cl2NO5/c11-1-3-13(4-2-12)5-6-7(14)8(15)9(16)10(17)18-6/h6-10,14-17H,1-5H2
charge 0 multiplicity 1
37 atoms
Cl 3.42737 -3.952395 0.741526
Cl 4.059959 2.742345 -1.769624
O  -1.509729 0.566444 1.510995
O  -0.631123 1.745838 -0.98281
O  -2.306231 -0.065496 -2.584991
O  -4.349659 -0.635358 -0.666069
O  -3.822395 0.564432 1.981035
N  2.089079 -0.025113 0.613753
C  -0.409408 -0.040339 0.70575
C  -0.680378 0.294599 -0.782793
C  -2.028487 -0.345219 -1.185787
C  -3.17101 0.146489 -0.277909
C  0.897668 0.562527 1.253746
C  -2.807945 -0.074964 1.199107
C  2.575289 -1.304375 1.166038
C  3.118607 0.930394 0.148046
C  2.785716 -2.315563 0.028627
C  2.75762 1.467185 -1.246435
H  -0.412903 -1.143845 0.852321
H  0.121353 -0.107748 -1.422341
H  -1.937779 -1.446505 -1.025543
H  -3.35283 1.230512 -0.433142
H  0.904799 0.428203 2.357497
H  0.882307 1.647979 1.053336
H  -2.723548 -1.164276 1.425315
H  1.826626 -1.708173 1.872045
H  3.522928 -1.185532 1.73444
H  4.094774 0.414825 0.095837
H  3.240541 1.783315 0.850522
H  -1.231416 2.166169 -0.311578
H  -3.225906 -0.390911 -2.770664
H  -5.134823 -0.295477 -0.167229
H  -3.637144 0.445674 2.946519
H  1.846287 -2.556017 -0.490369
H  3.552369 -1.989415 -0.690266
H  2.786081 0.676417 -2.010968
H  1.790842 1.992173 -1.268238
