program: Orca
programVersion: 5.0.2
elementType: S S O O O O C C C C C C C C C C C C H H H H H H H H H H H H H H H H H H
charge: 0
multiplicity: 1
keywords: wb97x-d3
keywords: def2-TZVPP
keywords: def2/J RIJCOSX
keywords: DEFGRID2
keywords: scfconv7
keywords: smallprint printgap noloewdin
keywords: NOSOSCF
formula: C12H18O4S2
InChI: InChI=1/C12H18O4S2/c1-7(2)15-10(13)9(11(14)16-8(3)4)12-17-5-6-18-12/h7-8H,5-6H2,1-4H3
36 atoms
S  -1.923675 -1.696101 0.001383
S  -2.639032 1.135855 -0.21283
O  1.528154 1.956089 0.258084
O  0.753539 -1.823817 0.33623
O  -0.40548 2.581183 -0.68564
O  2.087019 -0.491926 -0.868676
C  -0.038181 0.298519 -0.181993
C  -1.360519 -0.049787 -0.135225
C  -3.665166 -1.334301 -0.353492
C  -3.973882 0.002723 0.263838
C  2.125515 3.269097 0.124459
C  1.612765 -2.981805 0.179914
C  0.331795 1.720744 -0.251734
C  1.049277 -0.692199 -0.276015
C  3.011662 3.463899 1.334006
C  2.889243 3.325768 -1.182824
C  1.280175 -3.903369 1.331873
C  1.377599 -3.631633 -1.168565
H  -4.26142 -2.130031 0.092363
H  -3.828059 -1.332587 -1.430879
H  -4.906189 0.415746 -0.120709
H  -4.036201 -0.055666 1.350189
H  1.337769 4.023873 0.131728
H  2.65133 -2.655123 0.264613
H  3.474308 4.449229 1.285914
H  2.439705 3.411607 2.260593
H  3.809949 2.721232 1.373653
H  3.677422 2.571732 -1.210569
H  3.356252 4.30467 -1.292278
H  2.234797 3.174483 -2.041799
H  1.927122 -4.77914 1.290673
H  1.44105 -3.418117 2.294773
H  0.246318 -4.248535 1.283692
H  1.612622 -2.965849 -1.99833
H  0.343125 -3.961941 -1.270557
H  2.019986 -4.507519 -1.2607
elementType: S O C H
totalener: -1565.54811871 hartree
nucrepener: 1707.51349392 hartree
electener: -3273.06161264 hartree
oneelecener: -5546.22267042 hartree
twoeener: 2273.16105778 hartree
cpcmener: -0.03628575 hartree
kineticenergy: 1560.89647532 hartree
xcener: -111.413805735346 hartree
chargesum: 0.0000000
charge: -0.014159 0.003565 -0.296379 -0.294709 -0.480042 -0.496850 -0.142013 0.016554 -0.114792 -0.120219 0.160818 0.153071 0.451838 0.435203 -0.248670 -0.273990 -0.257749 -0.264124 0.124973 0.118470 0.124195 0.118539 0.067417 0.080468 0.091443 0.096984 0.089637 0.090537 0.102848 0.100524 0.097004 0.099426 0.089244 0.097661 0.088139 0.105137
qa: -0.0142 0.0036 -0.2964 -0.2947 -0.4800 -0.4969 -0.1420 0.0166 -0.1148 -0.1202 0.1608 0.1531 0.4518 0.4352 -0.2487 -0.2740 -0.2577 -0.2641 0.1250 0.1185 0.1242 0.1185 0.0674 0.0805 0.0914 0.0970 0.0896 0.0905 0.1028 0.1005 0.0970 0.0994 0.0892 0.0977 0.0881 0.1051
va: 2.5054 2.5174 2.1367 2.1218 1.9985 1.9899 3.3804 4.2114 3.9554 3.9436 3.8063 3.7851 4.1554 4.1727 3.9295 3.9283 3.9435 3.9090 1.0082 1.0130 1.0091 1.0133 1.0270 1.0207 1.0053 1.0080 1.0066 1.0080 1.0061 1.0084 1.0054 1.0082 1.0029 1.0157 1.0086 1.0063
dispcorr: -0.015756072 hartree
energy: -1565.563874786312
dipole: 13.67804 -15.49778 -1.81973 -4.99737 3.31197 -1.68540 2.38162 -1.44720 0.93442
magnitude: 2.65050 au
magnitude: 6.73703 debye
