program: Gaussian 09
title: 000065904
version: EM64L-G09RevD.01
frameworkgroup: C1[X(C17H15Cl2N3O5S)]
method: RPBEPBE
basis: SDD
operation: Freq
keyword: #p
keyword: freq=noraman
keyword: PBEPBE/SDD
title: #p freq=noraman PBEPBE/SDD
converged: NO YES NO NO
title: Mulliken charges:
elementType: Cl Cl S O O O O O N N N C C C C C C C C C C C C C C C C C H H H H H H H H H H H H H H H
charge: 0.002292 0.002534 0.920207 -0.268714 -0.248987 -0.195755 -0.552844 -0.551100 -0.249742 -0.085375 -0.415342 -0.483665 0.450460 0.243333 0.154281 -0.598828 -0.330752 -0.403706 0.516642 -0.270110 -0.291738 -0.115055 0.397595 -0.243048 -0.216799 -0.303331 -0.354356 -0.739993 0.264197 0.285585 0.241149 0.233359 0.252815 0.367294 0.337685 0.311764 0.287890 0.289855 0.263115 0.271462 0.265995 0.293347 0.266386
chargesum: 0.00000
title: Mulliken charges with hydrogens summed into heavy atoms:
elementType: Cl Cl S O O O O O N N N C C C C C C C C C C C C C C C C C
charge: 0.002292 0.002534 0.920207 -0.268714 -0.248987 -0.195755 -0.552844 -0.551100 -0.249742 -0.085375 -0.048049 0.066117 0.450460 0.243333 0.154281 0.128495 0.006933 -0.091942 0.516642 -0.270110 -0.291738 -0.115055 0.397595 0.044842 0.073056 -0.040216 -0.082894 0.085734
polarizability: 4.20040525e+02 9.30129041e+00 2.34287054e+02 -2.14561433e+01 6.67209266e+00 1.96193597e+02
1716.lowfreq: -7.2146 -0.0016 -0.0014 0.0009 1.6268 2.7689 9.7594 15.8208 17.0895
frequency: 9.4863 15.7411 17.0384 29.0920 45.7124 52.6179 65.0909 77.3275 100.7878 109.0108 115.9042 130.3076 150.3246 152.8848 160.7235 164.0600 192.4057 201.2431 204.5452 214.0895 224.9701 233.7176 242.9476 266.2071 298.7955 302.2204 335.0474 360.8254 364.6241 368.3582 381.9762 395.7851 414.2021 432.0458 450.0199 463.6230 472.7987 502.7138 510.8059 513.2401 545.3987 563.8411 571.4360 590.2633 605.2137 613.9373 626.7038 633.0546 681.6317 700.1484 710.8690 743.4232 759.7285 764.1358 782.3419 790.3194 829.7723 844.7913 856.1110 859.3161 884.2597 897.3598 905.8440 910.4220 957.9512 967.4597 974.1722 976.4636 992.3597 1005.4144 1020.3715 1041.1110 1049.3646 1057.8575 1081.2661 1109.3011 1126.1253 1159.2398 1176.3728 1188.7232 1204.9078 1220.8235 1240.7583 1265.6774 1281.5031 1283.5513 1300.4929 1309.1056 1334.6961 1353.5843 1370.5672 1390.0526 1395.1763 1403.9013 1406.9010 1420.3001 1423.9996 1434.5471 1447.4954 1463.7099 1465.1307 1479.2736 1547.1456 1586.1643 1596.3706 1606.6298 1630.3465 1660.2912 2949.5328 3017.3036 3029.6064 3065.9938 3108.5381 3113.9181 3148.7664 3152.9192 3167.9236 3179.4231 3180.0413 3183.6818 3193.0607 3200.6394 3515.1574
redmass: 10.0912 5.2579 10.8339 8.8696 7.3890 4.1047 5.5464 13.1049 9.5752 5.5060 5.2273 4.4639 1.1851 3.7872 6.3422 12.4911 5.5213 2.2625 4.4005 1.7247 8.2516 4.4267 6.2748 10.3875 9.8532 9.6145 9.0998 4.0952 5.7379 6.5339 4.6176 9.4216 2.9527 7.3425 6.2591 4.8791 5.8051 3.0259 5.5341 3.9583 7.2593 8.1560 4.9264 6.7143 4.6347 6.6506 5.7053 4.3955 5.2570 5.4733 4.0680 8.2794 1.5910 10.0362 9.7112 7.5786 1.2747 1.5341 4.2294 6.2709 3.1919 3.6661 1.4209 1.3302 1.3319 1.4018 1.3563 2.2698 3.8922 1.8411 4.2703 3.4447 2.5163 2.3984 2.4414 1.2754 1.5279 1.4934 1.5816 1.7446 2.6574 2.9601 5.1243 2.6395 2.5668 1.2537 1.1398 1.3340 6.5332 6.5328 1.6907 6.0534 5.5000 4.2122 1.0531 1.0609 1.1041 1.1225 3.7794 2.3796 1.0532 1.0498 9.5607 6.3343 7.9780 8.0120 8.2430 6.7909 1.0446 1.0648 1.0246 1.0883 1.1002 1.1015 1.0887 1.0900 1.0962 1.0966 1.1068 1.1079 1.0915 1.0931 1.0770
irintensity: 1.1239 4.0173 1.1107 0.4179 0.5051 1.4474 5.5488 0.3481 1.1320 1.2627 0.9402 5.1367 0.6271 3.5815 1.6774 0.4186 1.1338 0.3625 0.1003 2.7440 1.6809 0.4341 9.3009 5.0456 1.0822 7.1992 11.9948 2.8046 15.4434 5.8283 15.4859 41.7664 0.0107 3.5501 44.8899 4.5571 16.3808 11.8998 0.4030 1.7713 27.7463 20.7410 49.7331 39.6035 8.9293 1.0690 11.9163 9.8042 7.0663 4.4734 6.4058 21.4146 108.1541 69.0825 33.8032 57.2918 6.4818 53.8300 18.2281 32.2527 34.5372 18.1743 39.4837 10.9864 2.5084 92.7966 0.6627 17.3942 1.4235 56.9134 4.4908 9.8771 49.2922 5.0388 4.2667 7.7192 5.2510 124.1867 3.0192 65.9819 132.1689 46.3932 912.1740 59.9236 19.1831 3.8145 4.1272 5.3772 255.5128 16.6843 1.4985 3.5235 25.9015 5.8360 9.1355 17.5024 15.8750 13.0798 642.1138 48.4591 12.3328 5.1011 41.5312 62.1805 98.0098 105.8111 238.6652 410.7749 49.0125 9.8784 1.1673 16.3326 2.0452 13.7693 1.2896 1.0875 7.4355 3.5128 1.7560 1.2915 5.9481 30.9677 74.6595
temp: 298.150 k
press: 1.00000 atm
elementType: 17 17 16 8 8 8 8 8 7 7 7 6 6 6 6 6 6 6 6 6 6 6 6 6 6 6 6 6 1 1 1 1 1 1 1 1 1 1 1 1 1 1 1
symmnumber: 1
zpe: 783714.3 jmol-1
zpe.correction: 0.298501 hartree
zpe.thermalcorrener: 0.325960 hartree
zpe.thermalcorrenthalpy: 0.326905 hartree
zpe.thermalcorrgfe: 0.236487 hartree
zpe.sumelectzpe: -2513.149256 hartree
zpe.sumelectthermal: -2513.121796 hartree
zpe.sumelectthermalent: -2513.120852 hartree
zpe.sumelectthermalfe: -2513.211270 hartree
dipole: -5.2900 1.7444 0.5567
dipole: 5.5980
quadrupole: -224.7325 -189.0971 -184.0051
quadrupole: 42.1999 -10.4433 4.5551
quadrupole: -25.4542 10.1811 15.2731 42.1999 -10.4433 4.5551
hfenergy: -2513.4477568 hartree
pointgroup: C01 [X(C17H15Cl2N3O5S1)]
dipole: -2.0927282 0.0302861 -0.6856858 debye
polarizability: 421.0959142|-15.4022267|193.8233459|-7.9726503|0.2038927|235.6019166 unknown
InChI: InChI=1S/C17H15Cl2N3O5S/c1-21-9-15(23)20-17(24)22(21)10-7-13(18)16(14(19)8-10)27-11-3-5-12(6-4-11)28(2,25)26/h3-8,20H,9H2,1-2H3
charge 0 multiplicity 1
43 atoms
Cl 0.305185 -1.096906 2.844639
Cl 0.475419 -1.45825 -2.695797
S  6.674098 1.37517 0.019839
O  1.513864 -1.80907 0.145834
O  -4.228825 0.118861 -2.437053
O  -7.901388 0.587189 0.355288
O  6.318363 2.914624 0.451861
O  7.786036 0.468734 0.809468
N  -3.811272 0.180037 -0.096827
N  -4.35104 0.615567 1.172845
N  -5.979937 0.585931 -0.974187
C  -5.701617 0.050766 1.387353
C  -2.45117 -0.283635 -0.080943
C  -4.614497 0.284779 -1.249426
C  -6.661583 0.4303 0.250284
C  -4.245312 2.094795 1.333799
C  -1.74223 -0.590587 -1.27489
C  -1.814842 -0.437963 1.178529
C  0.241306 -1.217293 0.064487
C  -0.490895 -0.897895 1.231307
C  -0.420369 -1.054313 -1.174944
C  5.051297 0.403782 0.015893
C  2.674802 -1.000773 0.098652
C  3.850158 1.122666 -0.083543
C  5.107922 -0.991475 0.184696
C  2.634818 0.405353 -0.045314
C  3.894667 -1.705525 0.221681
C  7.215728 1.429821 -1.819527
H  -6.104055 0.428505 2.340032
H  -5.633365 -1.050563 1.456473
H  -4.563069 2.350765 2.358257
H  -4.86159 2.667977 0.608803
H  -3.189139 2.386368 1.21591
H  -6.545624 0.773769 -1.8094
H  -2.218002 -0.474509 -2.248662
H  -2.370863 -0.212743 2.089816
H  3.866176 2.215312 -0.156766
H  6.071729 -1.494468 0.315739
H  1.679759 0.933673 -0.119757
H  3.871539 -2.790673 0.352452
H  6.422335 1.95047 -2.372758
H  8.159513 1.992764 -1.816294
H  7.353174 0.389363 -2.143854
