program: Orca
programVersion: 5.0.2
elementType: S P O O O C C C C C C C C C C C C C H H H H H H H H H H H H H H H H H H H H H
charge: 0
multiplicity: 1
keywords: wb97x-d3
keywords: def2-TZVPP
keywords: def2/J RIJCOSX
keywords: DEFGRID2
keywords: scfconv7
keywords: smallprint printgap noloewdin
keywords: NOSOSCF
formula: C13H21O3PS
InChI: InChI=1/C13H21O3PS/c1-11(2)15-17(14,16-12(3)4)18-10-13-8-6-5-7-9-13/h5-9,11-12H,10H2,1-4H3
39 atoms
S  0.025297 0.806604 -1.852382
P  0.163316 -0.941577 -0.739906
O  0.395091 -0.569909 0.792127
O  1.542425 -1.4787 -1.32748
O  -1.002789 -1.853521 -0.851353
C  1.206714 0.513348 1.315163
C  1.859935 -2.900081 -1.401444
C  -1.736818 1.225268 -1.543329
C  0.807403 0.672647 2.764616
C  2.685842 0.230676 1.155202
C  3.108902 -3.006696 -2.24449
C  2.040172 -3.486172 -0.017736
C  -2.038584 1.624657 -0.133258
C  -2.802327 0.798261 0.684472
C  -1.57428 2.836865 0.374462
C  -3.111946 1.182983 1.983279
C  -1.878409 3.219594 1.671105
C  -2.652624 2.394131 2.478923
H  0.945158 1.422748 0.767114
H  1.033103 -3.400409 -1.910978
H  -2.352998 0.388856 -1.868399
H  -1.920048 2.051215 -2.231803
H  1.321634 1.534721 3.188693
H  -0.264628 0.8401 2.869167
H  1.082167 -0.205102 3.351935
H  2.998522 0.211829 0.112164
H  2.961406 -0.71686 1.620626
H  3.251565 1.021953 1.647522
H  3.958868 -2.524783 -1.758994
H  3.356892 -4.057641 -2.390913
H  2.967401 -2.558705 -3.228088
H  2.830558 -2.972283 0.531238
H  2.321251 -4.535689 -0.107739
H  1.123464 -3.447467 0.571362
H  -3.168162 -0.146427 0.30139
H  -0.973289 3.485955 -0.251642
H  -3.712449 0.533272 2.606617
H  -1.515682 4.16551 2.051633
H  -2.892452 2.69434 3.49056
elementType: S P O C H
totalener: -1473.47930498 hartree
nucrepener: 1774.91369392 hartree
electener: -3248.39299891 hartree
oneelecener: -5552.29687014 hartree
twoeener: 2303.90387124 hartree
cpcmener: -0.03198045 hartree
kineticenergy: 1468.62922819 hartree
xcener: -107.910908541589 hartree
chargesum: -0.0000000
charge: -0.184079 0.820391 -0.346150 -0.360399 -0.655634 0.151193 0.145432 -0.074894 -0.258003 -0.284191 -0.256672 -0.275454 0.031507 -0.185410 -0.183861 -0.142131 -0.158665 -0.168674 0.078860 0.087990 0.138365 0.152711 0.097856 0.087813 0.101225 0.094949 0.100533 0.108518 0.091162 0.092655 0.097951 0.095323 0.107363 0.096629 0.140281 0.140833 0.158481 0.157743 0.158455
qa: -0.1841 0.8204 -0.3462 -0.3604 -0.6556 0.1512 0.1454 -0.0749 -0.2580 -0.2842 -0.2567 -0.2755 0.0315 -0.1854 -0.1839 -0.1421 -0.1587 -0.1687 0.0789 0.0880 0.1384 0.1527 0.0979 0.0878 0.1012 0.0949 0.1005 0.1085 0.0912 0.0927 0.0980 0.0953 0.1074 0.0966 0.1403 0.1408 0.1585 0.1577 0.1585
va: 2.2528 5.4872 2.0394 2.0930 1.9450 3.7765 3.8220 3.8053 3.9115 3.9369 3.9418 3.8970 3.4783 3.9061 3.8875 3.8705 3.8608 3.8728 1.0143 1.0134 1.0204 0.9948 1.0055 1.0135 1.0093 1.0153 1.0014 1.0103 1.0037 1.0058 1.0080 1.0010 1.0090 1.0204 1.0174 1.0057 0.9907 0.9908 0.9911
dispcorr: -0.022080064 hartree
energy: -1473.501385046806
dipole: 13.35974 -11.98961 1.37013 -4.53018 5.58924 1.05907 10.12539 -9.53568 0.58971
magnitude: 1.82938 au
magnitude: 4.64992 debye
