program: Orca
programVersion: 5.0.2
elementType: S P O O O C C C C C C C C C C C C C H H H H H H H H H H H H H H H H H H H H H
charge: 0
multiplicity: 1
keywords: wb97x-d3
keywords: def2-TZVPP
keywords: def2/J RIJCOSX
keywords: DEFGRID2
keywords: scfconv7
keywords: smallprint printgap noloewdin
keywords: NOSOSCF
formula: C13H21O3PS
InChI: InChI=1/C13H21O3PS/c1-11(2)15-17(14,16-12(3)4)18-10-13-8-6-5-7-9-13/h5-9,11-12H,10H2,1-4H3
39 atoms
S  -0.524757 -0.415138 -0.105946
P  1.325896 -0.69964 0.799543
O  2.251184 0.538133 0.43813
O  1.95405 -1.87865 -0.064375
O  1.247384 -0.88611 2.268604
C  2.457561 1.024251 -0.918604
C  1.46634 -3.2503 0.038243
C  -1.282436 0.73804 1.116585
C  2.007438 2.465926 -0.961914
C  3.917625 0.839596 -1.26408
C  1.451707 -3.816195 -1.362222
C  2.363908 -4.016038 0.982633
C  -2.469998 1.380765 0.470489
C  -2.320356 2.555089 -0.263037
C  -3.732015 0.803082 0.574847
C  -3.414984 3.147339 -0.874821
C  -4.828437 1.393973 -0.038325
C  -4.672302 2.566738 -0.764781
H  1.846136 0.438337 -1.610568
H  0.445543 -3.236881 0.432896
H  -0.54257 1.485901 1.397909
H  -1.564282 0.168145 1.999391
H  2.149327 2.86414 -1.966558
H  0.949061 2.561172 -0.714152
H  2.583796 3.0825 -0.270534
H  4.208424 -0.209996 -1.219827
H  4.560887 1.409178 -0.59172
H  4.098546 1.19229 -2.27953
H  0.798863 -3.240964 -2.019159
H  2.454025 -3.832598 -1.792822
H  1.080062 -4.840253 -1.33767
H  2.016131 -5.045999 1.061571
H  2.353239 -3.584275 1.983193
H  3.392848 -4.034894 0.620692
H  -1.339934 3.008548 -0.352129
H  -3.857521 -0.11287 1.13987
H  -3.287851 4.064754 -1.434611
H  -5.805897 0.938589 0.053306
H  -5.52799 3.030638 -1.237873
elementType: S P O C H
totalener: -1473.48157102 hartree
nucrepener: 1693.68486688 hartree
electener: -3167.16643790 hartree
oneelecener: -5389.00448474 hartree
twoeener: 2221.83804684 hartree
cpcmener: -0.03417465 hartree
kineticenergy: 1468.61705595 hartree
xcener: -107.902632926785 hartree
chargesum: 0.0000000
charge: -0.194943 0.835908 -0.365228 -0.352383 -0.652533 0.157719 0.134492 -0.060349 -0.218761 -0.260096 -0.236878 -0.252337 -0.014039 -0.176753 -0.185260 -0.160920 -0.150973 -0.160280 0.071327 0.075096 0.137005 0.135099 0.096964 0.065056 0.093677 0.092159 0.090998 0.096432 0.094188 0.091702 0.094402 0.098100 0.087314 0.090864 0.175513 0.146054 0.159817 0.161075 0.160768
qa: -0.1949 0.8359 -0.3652 -0.3524 -0.6525 0.1577 0.1345 -0.0603 -0.2188 -0.2601 -0.2369 -0.2523 -0.0140 -0.1768 -0.1853 -0.1609 -0.1510 -0.1603 0.0713 0.0751 0.1370 0.1351 0.0970 0.0651 0.0937 0.0922 0.0910 0.0964 0.0942 0.0917 0.0944 0.0981 0.0873 0.0909 0.1755 0.1461 0.1598 0.1611 0.1608
va: 2.2436 5.5334 2.0765 2.0846 1.9500 3.8151 3.8260 3.8478 3.9210 3.9445 3.9189 3.9455 3.6596 3.9026 3.9494 3.9178 3.8825 3.8918 1.0128 1.0124 1.0001 1.0130 1.0087 1.0196 1.0092 1.0142 1.0065 1.0051 1.0076 1.0068 1.0069 1.0064 1.0213 1.0062 0.9740 1.0026 0.9922 0.9895 0.9894
dispcorr: -0.018042905 hartree
energy: -1473.499613922453
dipole: 8.33979 -8.87794 -0.53815 -2.75721 2.89778 0.14057 -9.36659 7.27752 -2.08906
magnitude: 2.16184 au
magnitude: 5.49496 debye
