program: Orca
programVersion: 5.0.2
elementType: S P O O O C C C C C C C C C C C C C H H H H H H H H H H H H H H H H H H H H H
charge: 0
multiplicity: 1
keywords: wb97x-d3
keywords: def2-TZVPP
keywords: def2/J RIJCOSX
keywords: DEFGRID2
keywords: scfconv7
keywords: smallprint printgap noloewdin
keywords: NOSOSCF
formula: C13H21O3PS
InChI: InChI=1/C13H21O3PS/c1-11(2)15-17(14,16-12(3)4)18-10-13-8-6-5-7-9-13/h5-9,11-12H,10H2,1-4H3
39 atoms
S  -0.66379 0.098292 -1.762366
P  0.397383 -1.082106 -0.413978
O  1.535117 -0.191602 0.26296
O  1.246856 -1.937693 -1.447792
O  -0.462485 -1.825529 0.542813
C  1.317479 0.624442 1.446944
C  2.100838 -3.04139 -1.013295
C  -2.305605 0.227849 -0.943826
C  2.492247 0.385407 2.367864
C  1.183051 2.072543 1.030519
C  1.916801 -4.145967 -2.028227
C  3.533037 -2.566775 -0.913324
C  -2.361573 1.268037 0.129989
C  -2.36852 0.906052 1.473383
C  -2.402165 2.620981 -0.203579
C  -2.404106 1.877353 2.466033
C  -2.438563 3.591099 0.785444
C  -2.435916 3.221452 2.125304
H  0.400136 0.296978 1.942488
H  1.757084 -3.389024 -0.035623
H  -2.596103 -0.755447 -0.580566
H  -2.973054 0.481127 -1.768401
H  3.430601 0.684457 1.89791
H  2.369234 0.974728 3.276507
H  2.565534 -0.662906 2.657224
H  0.344073 2.223709 0.351914
H  2.091434 2.427772 0.541154
H  1.01312 2.691485 1.911703
H  2.246611 -3.831307 -3.019459
H  2.509835 -5.012205 -1.7365
H  0.875346 -4.460518 -2.091614
H  3.884466 -2.170232 -1.866612
H  4.171773 -3.407838 -0.643939
H  3.658657 -1.801528 -0.148635
H  -2.347622 -0.140486 1.749284
H  -2.401671 2.917553 -1.245885
H  -2.409358 1.580004 3.50661
H  -2.471393 4.637576 0.511763
H  -2.464445 3.978276 2.898344
elementType: S P O C H
totalener: -1473.47881316 hartree
nucrepener: 1747.58624705 hartree
electener: -3221.06506022 hartree
oneelecener: -5497.53313661 hartree
twoeener: 2276.46807640 hartree
cpcmener: -0.02785460 hartree
kineticenergy: 1468.62528962 hartree
xcener: -107.905876464707 hartree
chargesum: 0.0000000
charge: -0.189030 0.857052 -0.356307 -0.377995 -0.652024 0.170898 0.152933 -0.068465 -0.271814 -0.281164 -0.244536 -0.256978 0.046607 -0.217073 -0.202804 -0.128685 -0.129754 -0.186264 0.075079 0.072388 0.133583 0.151814 0.094144 0.101467 0.098536 0.078025 0.108062 0.101899 0.088820 0.092630 0.096497 0.090477 0.098909 0.089058 0.146313 0.138337 0.159933 0.159774 0.159661
qa: -0.1890 0.8571 -0.3563 -0.3780 -0.6520 0.1709 0.1529 -0.0685 -0.2718 -0.2812 -0.2445 -0.2570 0.0466 -0.2171 -0.2028 -0.1287 -0.1298 -0.1863 0.0751 0.0724 0.1336 0.1518 0.0941 0.1015 0.0985 0.0780 0.1081 0.1019 0.0888 0.0926 0.0965 0.0905 0.0989 0.0891 0.1463 0.1383 0.1599 0.1598 0.1597
va: 2.2446 5.5115 2.0842 2.1200 1.9300 3.7885 3.8472 3.7981 3.9224 3.9276 3.9298 3.9379 3.4919 3.8879 3.9344 3.8670 3.8554 3.8927 1.0164 1.0128 1.0268 0.9985 1.0050 1.0066 1.0086 1.0143 1.0131 1.0051 1.0071 1.0058 1.0094 1.0079 1.0056 1.0135 1.0187 1.0066 0.9905 0.9895 0.9905
dispcorr: -0.021192581 hartree
energy: -1473.500005744488
dipole: 13.04528 -12.44313 0.60214 -0.89086 1.60956 0.71870 7.40878 -6.92861 0.48017
magnitude: 1.05341 au
magnitude: 2.67755 debye
