program: Gaussian 09
title: 000065900
version: EM64L-G09RevD.01
frameworkgroup: C1[X(C14H19ClN4O2)]
method: RPBEPBE
basis: SDD
operation: Freq
keyword: #p
keyword: freq=noraman
keyword: PBEPBE/SDD
title: #p freq=noraman PBEPBE/SDD
converged: YES YES NO NO
title: Mulliken charges:
elementType: Cl O O N N N N C C C C C C C C C C C C C C H H H H H H H H H H H H H H H H H H H
charge: -0.071507 -0.335804 -0.330960 -0.194791 -0.134100 -0.366111 -0.683532 -0.368574 0.268337 -0.491393 -0.397295 -0.489583 -0.664275 0.184701 0.107580 0.310373 -0.357352 -0.544410 0.680491 -0.380321 -0.525377 0.212782 0.222084 0.219209 0.224861 0.204818 0.298415 0.253210 0.249871 0.219386 0.208351 0.224372 0.364862 0.302313 0.234744 0.324400 0.311011 0.228200 0.227564 0.253450
chargesum: 0.00000
title: Mulliken charges with hydrogens summed into heavy atoms:
elementType: Cl O O N N N N C C C C C C C C C C C C C C
charge: -0.071507 -0.335804 -0.330960 -0.194791 -0.134100 -0.001250 -0.048120 0.066292 0.268337 -0.047324 0.105938 0.013498 -0.012165 0.184701 0.107580 0.310373 -0.055039 -0.309667 0.680491 -0.380321 0.183836
polarizability: 2.78917706e+02 1.70217950e+01 2.19368387e+02 -1.76653444e+01 3.00668061e+00 1.24918954e+02
1716.lowfreq: -7.9216 -6.2337 -1.9642 -0.0013 0.0011 0.0011 13.1343 23.9537 32.7069
frequency: 13.0659 23.8152 32.6751 60.3903 65.1178 79.7202 88.1719 92.6643 119.3667 127.7869 157.3629 183.7089 186.8777 199.5817 214.1043 228.1718 249.2200 272.3575 275.9063 315.4502 326.5522 347.9637 364.8555 373.4709 404.5815 414.5209 421.1952 445.5400 448.5546 493.9275 574.0912 581.7303 601.0106 628.4158 634.2437 656.1944 698.5394 719.7038 728.9841 740.4512 753.1986 756.7420 791.5412 795.6314 828.8334 832.6236 907.5218 935.1611 941.1807 949.9909 954.5618 999.5396 1013.7855 1020.5069 1045.4454 1050.1664 1063.9874 1080.2962 1114.0776 1122.2737 1147.1707 1163.1067 1164.0184 1179.4258 1211.4226 1223.7769 1241.8467 1245.3244 1253.3946 1283.0104 1295.6222 1306.5405 1318.0761 1353.3245 1374.9017 1381.5733 1383.9616 1420.4963 1437.5605 1449.0405 1450.3641 1467.5725 1468.8166 1469.7260 1473.8295 1476.0645 1495.8839 1503.1328 1504.7047 1525.2864 1547.6677 1575.9431 1585.0477 1618.4081 1642.2951 2952.3008 2970.2978 2979.5940 2981.9469 2990.1291 3016.1899 3031.2413 3041.5874 3054.4456 3064.0721 3079.1845 3082.1307 3096.6368 3130.2444 3155.8060 3160.0995 3454.1961 3548.4070 3697.3463
redmass: 4.3410 5.6161 4.3577 3.2939 4.2837 5.6337 2.8980 4.6782 3.0781 2.5036 5.8110 4.0017 3.5508 1.3783 1.8186 3.5125 4.3789 2.4010 3.4175 5.2280 3.0955 3.6984 2.7374 5.8450 1.3622 2.5232 4.1012 3.2939 3.0134 1.2062 6.0481 4.9754 3.9287 4.3183 9.4634 4.7982 3.1049 6.5900 1.3781 2.9108 4.2049 3.3298 1.1704 3.4123 1.4998 2.3121 3.4971 2.7807 1.3680 5.8643 2.7292 3.9128 3.6520 4.0455 2.5913 1.5952 1.9404 1.7485 1.2554 4.0419 1.7989 1.4474 1.1974 2.1733 1.1557 3.4669 1.4082 1.6360 1.9989 1.3006 1.3209 1.3445 4.8182 1.3377 1.2336 1.2164 3.9718 2.4140 2.5783 1.2968 1.4562 1.1075 1.0526 1.0456 1.0919 1.0630 1.1102 1.1908 2.6478 2.3193 6.4374 5.6369 6.0108 1.7998 2.3531 1.0626 1.0321 1.0377 1.0605 1.0695 1.0938 1.0591 1.1015 1.1032 1.1048 1.0997 1.1009 1.1036 1.1005 1.0901 1.0917 1.0800 1.0458 1.1033
irintensity: 2.9353 1.9449 2.5687 0.5999 0.3262 6.7659 0.6266 2.0220 0.8523 3.7474 2.5247 1.9650 4.8044 1.4468 0.9598 0.1562 1.3320 6.5159 4.3961 1.5361 4.6021 32.5265 7.6513 6.7838 82.1392 8.4954 41.2818 27.7211 38.2126 127.8582 5.4024 10.4210 2.7654 11.7260 10.4266 29.5145 1.0089 8.1262 48.4762 12.6135 1.8724 53.4577 11.3444 17.1529 1.0605 59.6728 20.0444 5.0307 14.1416 34.0200 6.1936 19.9350 22.2835 4.3546 2.8910 5.6829 11.1822 2.1836 0.2370 81.2696 4.4600 6.9602 5.0405 58.6854 6.9791 11.6816 162.9353 186.1524 55.0533 30.0511 3.2425 15.4275 133.1149 11.8039 4.9329 18.1739 29.6407 5.8592 63.7206 10.2398 52.4608 8.8146 10.2349 10.9038 43.5435 0.5768 24.6444 29.8872 236.1130 172.4830 43.6554 186.1961 258.2197 20.6171 445.6729 60.5921 55.1550 41.5014 40.3648 55.4123 51.2365 25.8951 23.2247 50.5967 37.8940 28.2344 43.9628 5.1483 12.8998 7.4739 13.6226 122.6942 122.3310 35.9943
temp: 298.150 k
press: 1.00000 atm
elementType: 17 8 8 7 7 7 7 6 6 6 6 6 6 6 6 6 6 6 6 6 6 1 1 1 1 1 1 1 1 1 1 1 1 1 1 1 1 1 1 1
symmnumber: 1
zpe: 841401.2 jmol-1
zpe.correction: 0.320473 hartree
zpe.thermalcorrener: 0.342205 hartree
zpe.thermalcorrenthalpy: 0.343149 hartree
zpe.thermalcorrgfe: 0.267272 hartree
zpe.sumelectzpe: -1372.825275 hartree
zpe.sumelectthermal: -1372.803543 hartree
zpe.sumelectthermalent: -1372.802599 hartree
zpe.sumelectthermalfe: -1372.878476 hartree
dipole: -3.2486 4.4680 2.9608
dipole: 6.2676
quadrupole: -108.1525 -122.6882 -132.0094
quadrupole: -25.0106 1.3431 1.3386
quadrupole: 12.7976 -1.7381 -11.0594 -25.0106 1.3431 1.3386
hfenergy: -1373.145748 hartree
pointgroup: C01 [X(C14H19Cl1N4O2)]
dipole: -1.2737075 -1.2236916 1.7206628 debye
polarizability: 269.4411367|36.1539975|131.5971431|19.653957|6.4353436|222.166767 unknown
InChI: InChI=1S/C14H19ClN4O2/c1-3-19-5-4-17-13(19)8-18-14(20)9-6-10(15)11(16)7-12(9)21-2/h6-7,18H,3-5,8,16H2,1-2H3
charge 0 multiplicity 1
40 atoms
Cl -4.503043 -1.374885 -2.796884
O  -1.078908 -0.071236 2.006237
O  0.328758 0.606093 -1.960766
N  3.708225 -0.578319 -0.422479
N  3.864198 0.472635 1.636884
N  0.812655 0.780412 0.308732
N  -5.282842 -1.772247 0.118114
C  4.876077 -1.259156 0.19739
C  3.273391 0.423215 0.452195
C  4.869387 -0.650136 1.644874
C  3.417027 -0.689624 -1.860541
C  2.142115 1.373741 0.102478
C  4.42261 0.064744 -2.766021
C  -0.018841 0.442277 -0.73802
C  -1.369534 -0.128911 -0.397785
C  -1.902267 -0.384699 0.905423
C  -2.197288 -0.446742 -1.5052
C  -3.192543 -0.926579 1.079431
C  -4.014506 -1.240114 -0.040671
C  -3.471273 -0.981663 -1.331968
C  -1.569004 -0.330481 3.36214
H  5.809843 -1.020982 -0.353125
H  4.743836 -2.357407 0.189203
H  4.558904 -1.399032 2.398479
H  5.859395 -0.265104 1.945899
H  3.412552 -1.764758 -2.127221
H  2.395104 -0.31255 -2.045307
H  2.196669 1.700683 -0.949222
H  2.256443 2.251031 0.760991
H  4.416141 1.147215 -2.543062
H  5.455379 -0.307733 -2.636876
H  4.143874 -0.065848 -3.82768
H  0.486417 0.590606 1.263418
H  -1.784045 -0.249595 -2.499582
H  -3.589104 -1.116482 2.081079
H  -5.845088 -1.983973 -0.703545
H  -5.665273 -1.952892 1.041025
H  -1.776379 -1.407159 3.509145
H  -2.476102 0.265519 3.57644
H  -0.751464 -0.015565 4.026779
