program: Gaussian 09
title: 000065954
version: EM64L-G09RevD.01
frameworkgroup: C1[X(C21H24N4O)]
method: RPBEPBE
basis: SDD
operation: Freq
keyword: #p
keyword: freq=noraman
keyword: PBEPBE/SDD
title: #p freq=noraman PBEPBE/SDD
converged: YES YES NO NO
title: Mulliken charges:
elementType: O N N N N C C C C C C C C C C C C C C C C C C C C C H H H H H H H H H H H H H H H H H H H H H H H H
charge: -0.435997 -0.474802 -0.386121 -0.069312 -0.105539 0.066607 0.065583 0.127561 0.203869 0.279575 0.033171 0.347573 0.423082 -0.414449 -0.356266 -0.446180 -0.465671 -0.398668 -0.335496 -0.550017 -0.606429 -0.835909 -0.432971 0.285993 -0.623929 -0.610011 0.315876 0.235592 0.232608 0.210505 0.320498 0.204053 0.256882 0.242402 0.190627 0.219641 0.247067 0.238852 0.262801 0.223865 0.225534 0.236842 0.224594 0.190722 0.234115 0.218250 0.193490 0.212149 0.224511 0.353272
chargesum: 0.00000
title: Mulliken charges with hydrogens summed into heavy atoms:
elementType: O N N N N C C C C C C C C C C C C C C C C C C C C C
charge: -0.082725 -0.158926 -0.065623 -0.069312 -0.105539 0.066607 0.065583 0.127561 0.203869 0.279575 0.033171 0.347573 0.423082 -0.178856 0.086847 0.014756 -0.223269 -0.151601 0.074772 -0.311164 -0.343628 -0.149668 -0.208377 0.285993 0.019158 0.020139
polarizability: 3.53656147e+02 2.93498486e+01 3.68289420e+02 -1.35568218e+01 -1.13259321e+00 1.36830953e+02
1716.lowfreq: -16.5538 -11.4882 -5.2608 -0.0007 -0.0006 0.0005 7.0654 29.9784 36.8451
frequency: -10.7137 29.9452 36.4170 49.0967 67.9140 68.1166 95.6700 104.2457 124.6951 144.3739 148.2520 178.2338 197.4580 206.9505 216.8470 233.5909 247.4617 260.3915 284.6902 293.2705 306.3718 312.9412 331.5353 348.4725 360.2131 386.3537 402.0898 408.8224 409.9828 413.4837 445.0326 460.5610 469.2614 499.0100 506.1863 521.4232 551.8716 559.1568 562.9542 579.1309 609.3235 627.2815 650.8002 673.5581 691.0284 696.6398 728.2128 751.5014 765.2763 771.4672 788.1970 802.4947 811.5870 813.9414 859.0681 875.5324 888.3075 895.1593 935.4490 949.7604 950.9784 961.5306 975.7398 984.6565 1004.6502 1012.8164 1032.4050 1043.1114 1056.8995 1073.8454 1083.0053 1094.5187 1122.1877 1133.8351 1147.5505 1151.8685 1156.3331 1173.7099 1187.1578 1202.2477 1225.9504 1247.3421 1256.0316 1261.7111 1267.0582 1272.6636 1293.9625 1303.0154 1317.1696 1339.4928 1348.7854 1353.8659 1365.8334 1368.5998 1376.8023 1393.0118 1396.5197 1403.4670 1413.7272 1424.4891 1436.3294 1439.2164 1443.5114 1453.3350 1456.6372 1462.1028 1469.6868 1470.5963 1473.0919 1475.5983 1476.5252 1477.5253 1488.2587 1512.0984 1538.7420 1572.0682 1575.1467 1605.5671 1608.3758 1643.5676 2835.1489 2846.0111 2862.2674 2952.7563 2987.6773 3006.3132 3008.9805 3010.9222 3020.4471 3024.1329 3053.7449 3067.4175 3076.1920 3076.8103 3080.7577 3109.3706 3116.1461 3127.9048 3150.9215 3154.7456 3163.3637 3586.1606 3589.8681 3613.2194
redmass: 3.9926 3.8504 3.5722 4.6906 3.1044 4.4165 3.9098 3.9738 4.0945 2.5834 1.3073 3.7752 2.9669 2.8317 2.1556 1.3195 1.6167 3.0789 4.7004 3.0833 3.9924 1.1268 2.6742 1.9821 4.5183 2.5807 3.2067 2.6743 2.7278 4.2202 2.8631 2.1227 3.5379 4.6576 1.2670 2.7867 4.0515 3.0715 3.3422 5.9071 3.7567 5.3468 8.9214 4.7457 4.1477 5.3314 2.0646 5.0061 5.0688 5.5588 2.7083 1.4567 2.4168 2.2075 5.7791 2.7545 1.6226 1.3782 2.7629 1.6151 1.9760 1.4995 2.3452 1.9835 2.5203 3.3892 1.5582 1.4634 1.8815 2.2370 1.5323 1.7961 2.3625 1.4979 1.4895 1.4027 1.4434 2.1565 1.5569 2.1721 1.5306 1.8473 1.6716 2.6442 2.6922 1.8008 1.9057 1.9019 1.6095 1.9713 1.6267 1.4393 2.9498 2.9021 1.4499 2.6560 3.2151 1.4408 1.1512 3.4855 1.1993 1.3536 4.0983 1.7206 1.1349 1.0666 1.0884 1.0457 2.1634 1.3438 1.1054 1.0684 1.0591 2.7374 5.3525 5.2507 6.1428 6.6143 7.3285 6.4584 1.0697 1.0571 1.0578 1.0384 1.0648 1.0720 1.0639 1.0808 1.0982 1.0725 1.0989 1.1011 1.1028 1.0957 1.1008 1.0913 1.0896 1.0868 1.0975 1.0926 1.0931 1.0661 1.0779 1.0802
irintensity: 0.1199 0.6380 0.1051 0.2174 0.5659 0.4588 4.7259 2.5189 0.4619 1.0959 0.1293 6.9561 3.8999 1.4285 0.4933 0.3494 1.0541 2.5160 0.7145 1.4755 3.0315 125.0643 22.8873 6.4681 8.5808 36.9066 1.0065 3.7964 28.9096 8.7098 2.4710 55.8011 15.3494 3.6864 62.6881 12.1946 8.3395 11.9063 1.2660 4.5781 3.2168 3.1750 0.8697 4.8012 7.5537 9.7920 23.4403 8.2064 2.5004 12.6971 2.2998 37.2982 7.1973 7.7075 20.7360 8.2903 46.2003 9.9750 39.1641 8.3574 6.7887 10.6373 14.5419 20.2343 8.5456 4.5825 10.8631 4.3168 10.2794 3.7450 13.6722 16.7382 40.3803 29.9057 113.2221 102.2675 11.9321 32.7818 18.5633 5.7257 6.3214 22.7333 5.5488 38.6992 18.2737 35.7519 15.6297 43.8608 0.7060 17.2027 20.6212 19.1803 104.0004 35.6358 12.4947 9.5798 4.7938 21.3611 4.2594 9.6406 11.4414 41.5387 0.4404 29.2602 5.3668 13.2094 24.7499 13.8604 11.9824 13.3540 18.1588 2.7646 8.8641 204.2124 56.5227 273.7735 34.3121 73.0886 18.2333 65.0324 54.4501 68.8935 297.3240 81.5235 26.7992 37.2679 23.3293 96.0097 28.7401 38.1101 27.5048 45.8917 32.7972 17.6347 30.3659 38.3536 14.2953 3.1765 16.9633 15.6160 4.6573 50.4383 35.4255 60.1608
temp: 298.150 k
press: 1.00000 atm
elementType: 8 7 7 7 7 6 6 6 6 6 6 6 6 6 6 6 6 6 6 6 6 6 6 6 6 6 1 1 1 1 1 1 1 1 1 1 1 1 1 1 1 1 1 1 1 1 1 1 1 1
symmnumber: 1
zpe: 1077744.8 jmol-1
zpe.correction: 0.410491 hartree
zpe.thermalcorrener: 0.433796 hartree
zpe.thermalcorrenthalpy: 0.434740 hartree
zpe.thermalcorrgfe: 0.358638 hartree
zpe.sumelectzpe: -1107.008070 hartree
zpe.sumelectthermal: -1106.984766 hartree
zpe.sumelectthermalent: -1106.983822 hartree
zpe.sumelectthermalfe: -1107.059923 hartree
dipole: -0.1437 -0.1222 0.6037
dipole: 0.6325
quadrupole: -112.1769 -162.5498 -159.6649
quadrupole: 1.7835 -2.1858 -0.2186
quadrupole: 32.6203 -17.7526 -14.8677 1.7835 -2.1858 -0.2186
hfenergy: -1107.4185614 hartree
pointgroup: C01 [X(C21H24N4O1)]
dipole: -0.0710967 0.0346678 0.2359475 debye
polarizability: 389.4020333|-10.8912668|333.1591981|-4.6012803|5.5795145|136.215289 unknown
InChI: InChI=1S/C21H24N4O/c1-13-12-23-21(22-9-4-10-25(2)3)19-18-16-7-6-15(26)11-14(16)5-8-17(18)24-20(13)19/h5-8,11-12,22,24,26H,4,9-10H2,1-3H3
charge 0 multiplicity 1
50 atoms
O  5.487169 0.464727 -0.04433
N  -1.868959 3.083457 0.147272
N  -0.982619 -1.508038 -0.740859
N  -3.157018 -0.860206 -0.174105
N  0.87923 -4.273172 0.379736
C  -0.130736 1.578606 -0.023247
C  -1.400508 0.84514 -0.063944
C  -2.449166 1.816238 0.091675
C  -0.475499 2.965131 0.058129
C  1.275821 1.230322 0.001138
C  -1.840605 -0.509263 -0.307962
C  -3.826809 1.484548 0.183046
C  2.252328 2.310346 -0.074925
C  0.475171 4.020355 0.025112
C  -1.427906 -2.882143 -1.022993
C  -1.603965 -3.743917 0.24984
C  1.822741 3.685537 -0.07637
C  1.785902 -0.098432 0.162829
C  -0.335921 -3.841651 1.120156
C  -4.091241 0.105868 0.083586
C  3.649178 2.009377 -0.097966
C  -4.907959 2.52574 0.378262
C  3.157938 -0.371839 0.153517
C  4.096676 0.690134 -0.007959
C  0.760771 -5.628376 -0.197014
C  2.091925 -4.148958 1.214666
H  -2.38016 3.958141 0.237478
H  0.15423 5.067009 0.06589
H  -2.393017 -2.846073 -1.560822
H  -0.66488 -3.337642 -1.678512
H  -0.044495 -1.245886 -1.034586
H  -1.951703 -4.750197 -0.057215
H  -2.413221 -3.301454 0.859181
H  2.584389 4.471394 -0.127132
H  -0.546163 -4.521277 1.987906
H  -0.123296 -2.840244 1.54173
H  1.099915 -0.92323 0.371923
H  -5.12132 -0.258274 0.189738
H  4.3835 2.818071 -0.168924
H  -4.758226 3.114042 1.30593
H  -4.95279 3.241966 -0.466919
H  -5.899271 2.045882 0.451122
H  3.508044 -1.404284 0.283507
H  0.595914 -6.421773 0.576689
H  -0.079537 -5.670919 -0.910586
H  1.68531 -5.875998 -0.74928
H  2.090629 -4.830403 2.104094
H  2.988184 -4.38384 0.610936
H  2.182716 -3.112794 1.588693
H  5.686806 -0.50085 0.032069
