program: Orca
programVersion: 5.0.2
elementType: S P O O O C C C C C C C C C C C C C H H H H H H H H H H H H H H H H H H H H H
charge: 0
multiplicity: 1
keywords: wb97x-d3
keywords: def2-TZVPP
keywords: def2/J RIJCOSX
keywords: DEFGRID2
keywords: scfconv7
keywords: smallprint printgap noloewdin
keywords: NOSOSCF
formula: C13H21O3PS
InChI: InChI=1/C13H21O3PS/c1-11(2)15-17(14,16-12(3)4)18-10-13-8-6-5-7-9-13/h5-9,11-12H,10H2,1-4H3
39 atoms
S  0.148193 1.719734 -0.912374
P  1.135913 0.296582 0.244573
O  2.615759 0.597513 -0.252883
O  0.886051 -1.14774 -0.386886
O  0.848165 0.395084 1.696665
C  3.742739 -0.226792 0.169728
C  -0.129032 -2.065238 0.099036
C  -1.226521 2.209406 0.202161
C  4.677972 -0.325935 -1.013538
C  4.385467 0.404597 1.385307
C  -1.188427 -2.214759 -0.969529
C  0.562445 -3.36658 0.439393
C  -2.366547 1.239256 0.218311
C  -2.619922 0.459502 1.342175
C  -3.195564 1.106132 -0.894975
C  -3.676692 -0.443121 1.352025
C  -4.251531 0.208891 -0.885452
C  -4.49326 -0.572499 0.238775
H  3.383568 -1.227743 0.425482
H  -0.582413 -1.653554 1.003602
H  -1.539559 3.175306 -0.195509
H  -0.824087 2.385382 1.197331
H  5.536525 -0.94501 -0.751521
H  4.187227 -0.783979 -1.873337
H  5.050905 0.656402 -1.30906
H  5.236651 -0.196962 1.705273
H  3.688985 0.461908 2.221879
H  4.747397 1.410188 1.165756
H  -0.771612 -2.63377 -1.887239
H  -1.972098 -2.88684 -0.619722
H  -1.653137 -1.257837 -1.20818
H  1.299372 -3.232725 1.23234
H  1.063348 -3.78989 -0.433347
H  -0.171853 -4.09314 0.788705
H  -1.990397 0.558192 2.217922
H  -3.014116 1.711682 -1.775884
H  -3.861083 -1.043289 2.234125
H  -4.887496 0.11734 -1.756896
H  -5.314884 -1.277681 0.244631
elementType: S P O C H
totalener: -1473.49044177 hartree
nucrepener: 1747.70189794 hartree
electener: -3221.19233971 hartree
oneelecener: -5497.58241733 hartree
twoeener: 2276.39007762 hartree
cpcmener: -0.02301071 hartree
kineticenergy: 1468.60403855 hartree
xcener: -107.899995446710 hartree
chargesum: 0.0000000
charge: -0.190454 0.844433 -0.363754 -0.358192 -0.624975 0.142538 0.180421 -0.070765 -0.245593 -0.252916 -0.277513 -0.269673 0.052435 -0.217617 -0.196883 -0.126241 -0.132052 -0.181608 0.071605 0.067480 0.150232 0.130780 0.090488 0.095947 0.089756 0.096565 0.088059 0.089934 0.104876 0.099177 0.080046 0.096564 0.093440 0.097558 0.143945 0.133651 0.156461 0.155713 0.156135
qa: -0.1905 0.8444 -0.3638 -0.3582 -0.6250 0.1425 0.1804 -0.0708 -0.2456 -0.2529 -0.2775 -0.2697 0.0524 -0.2176 -0.1969 -0.1262 -0.1321 -0.1816 0.0716 0.0675 0.1502 0.1308 0.0905 0.0959 0.0898 0.0966 0.0881 0.0899 0.1049 0.0992 0.0800 0.0966 0.0934 0.0976 0.1439 0.1337 0.1565 0.1557 0.1561
va: 2.2455 5.5213 2.1278 2.0720 1.9605 3.8786 3.7818 3.8017 3.9209 3.9167 3.9343 3.9333 3.4960 3.8991 3.9430 3.8648 3.8637 3.8996 1.0034 1.0204 0.9977 1.0290 1.0063 1.0094 1.0076 1.0062 1.0233 1.0072 1.0133 1.0047 1.0114 1.0077 1.0064 1.0071 1.0181 1.0090 0.9915 0.9913 0.9916
dispcorr: -0.021019275 hartree
energy: -1473.511461047633
dipole: 6.20224 -6.46310 -0.26086 -14.23090 13.18612 -1.04478 1.10583 -1.48752 -0.38168
magnitude: 1.14249 au
magnitude: 2.90399 debye
