program: Gaussian 09
title: 000065865
version: EM64L-G09RevD.01
frameworkgroup: C1[X(C10H14N2O2)]
method: RPBEPBE
basis: SDD
operation: Freq
keyword: #p
keyword: freq=noraman
keyword: PBEPBE/SDD
title: #p freq=noraman PBEPBE/SDD
converged: YES YES NO NO
title: Mulliken charges:
elementType: O O N N C C C C C C C C C C H H H H H H H H H H H H H H
charge: -0.295904 -0.209698 -0.124823 -0.015212 -0.402063 -0.380567 -0.374391 -0.391604 -0.396508 0.176727 -0.009368 0.265880 -0.337906 -0.765681 0.225596 0.192027 0.219080 0.206429 0.207508 0.208297 0.210605 0.265763 0.245611 0.207981 0.283817 0.243188 0.250928 0.294288
chargesum: 0.00000
title: Mulliken charges with hydrogens summed into heavy atoms:
elementType: O O N N C C C C C C C C C C
charge: -0.295904 -0.209698 -0.124823 -0.015212 0.015560 0.044942 0.041414 0.084764 0.057085 0.176727 -0.009368 0.265880 -0.054089 0.022724
polarizability: 1.57609295e+02 3.59374113e+00 1.24280565e+02 8.21944487e+00 7.73600341e+00 9.28542886e+01
1716.lowfreq: -19.7956 -9.3263 -0.0005 -0.0004 0.0001 11.7916 41.6063 60.1913 69.8751
frequency: 41.1383 59.9631 69.6876 77.1564 109.3741 180.5549 203.4134 230.0930 256.2774 270.0286 331.1691 375.0737 393.5260 401.3775 442.1792 483.3172 554.0496 587.8795 620.4273 637.4510 690.7159 735.5688 779.1134 801.8051 811.6516 846.4727 864.2741 868.0976 902.7188 913.0539 948.1732 951.6645 996.0414 1037.5524 1050.5197 1086.3631 1089.8263 1121.1915 1152.7842 1157.6395 1168.1366 1211.3558 1226.2450 1240.7629 1255.5767 1280.6032 1312.3000 1330.1157 1338.0802 1343.5144 1350.4780 1367.0552 1394.9771 1419.0762 1439.1519 1453.1365 1455.5454 1456.9576 1463.8750 1465.4627 1470.2022 1474.4338 1550.4551 1592.6299 2958.5459 2966.3569 2970.0820 2985.2641 2990.5026 2992.0889 3039.1188 3047.5656 3057.2620 3077.5449 3093.1980 3096.4590 3120.3272 3209.6478
redmass: 3.5500 3.6252 2.6722 1.2833 5.0324 2.9539 3.4294 3.4155 4.7714 2.2461 2.7284 2.4043 6.2740 2.4360 3.2123 3.0858 2.3274 7.2241 5.1874 3.6183 5.7247 6.2272 8.6169 1.5152 3.4401 1.5253 2.6363 1.4303 5.1635 3.0487 1.3746 2.0516 2.4489 2.1373 1.5015 1.9990 1.5475 2.4201 1.4517 1.7658 1.5688 4.9413 2.2560 2.3578 1.2872 1.1832 3.1773 1.2763 1.3571 1.4437 1.4368 1.4591 1.2293 3.0081 3.6999 1.1402 1.0904 1.1458 1.0907 1.1091 1.0666 1.1054 7.1331 7.3168 1.0697 1.0687 1.0642 1.0608 1.0612 1.0380 1.0963 1.1024 1.1030 1.0961 1.0942 1.0931 1.0996 1.0965
irintensity: 0.7817 0.5756 2.1876 0.2256 3.7970 5.2408 3.0593 3.9200 2.1345 5.0188 2.9102 4.1014 0.4307 7.0469 0.3280 7.5874 3.4517 2.1317 7.2434 5.3735 0.3353 9.3836 4.2609 0.5041 10.5994 12.6334 13.6102 23.2931 1.8922 1.8869 4.3029 14.4723 67.3729 0.3966 5.7492 42.2550 18.1805 8.2564 4.7827 18.3795 11.4093 28.7821 30.6629 57.4424 2.7295 13.7903 32.3351 0.9080 1.4108 8.3226 2.5899 8.3941 35.5372 105.1953 42.4695 50.0454 10.7852 19.0695 6.3113 12.9458 16.9317 4.3460 218.7211 149.1796 29.1416 47.8818 48.1186 27.0286 29.2189 14.6234 52.1171 34.7603 77.4618 8.3842 5.6865 15.6880 0.1630 0.3984
temp: 298.150 k
press: 1.00000 atm
elementType: 8 8 7 7 6 6 6 6 6 6 6 6 6 6 1 1 1 1 1 1 1 1 1 1 1 1 1 1
symmnumber: 1
zpe: 602878.7 jmol-1
zpe.correction: 0.229624 hartree
zpe.thermalcorrener: 0.242772 hartree
zpe.thermalcorrenthalpy: 0.243716 hartree
zpe.thermalcorrgfe: 0.189091 hartree
zpe.sumelectzpe: -648.319311 hartree
zpe.sumelectthermal: -648.306164 hartree
zpe.sumelectthermalent: -648.305220 hartree
zpe.sumelectthermalfe: -648.359844 hartree
dipole: -4.4965 -0.9782 1.2453
dipole: 4.7672
quadrupole: -87.0335 -88.4047 -80.8010
quadrupole: 10.4066 3.7374 4.5157
quadrupole: -1.6204 -2.9916 4.6121 10.4066 3.7374 4.5157
hfenergy: -648.5489354 hartree
pointgroup: C01 [X(C10H14N2O2)]
dipole: 1.737796 0.6243589 -0.3286574 debye
polarizability: 155.1090075|-6.3216642|93.8890754|-11.5115279|-8.8857886|125.7460654 unknown
InChI: InChI=1S/C10H14N2O2/c1-8-9(7-11-14-8)10(13)12-5-3-2-4-6-12/h7H,2-6H2,1H3
charge 0 multiplicity 1
28 atoms
O  0.110788 -1.42554 1.516259
O  -3.415992 0.673877 0.255699
N  1.160613 -0.382923 -0.287642
N  -3.11768 0.566941 -1.188588
C  3.739237 1.003539 -0.499316
C  3.531184 -0.167554 0.489824
C  2.400844 1.733104 -0.758194
C  2.421104 -1.116573 -0.013306
C  1.300737 0.748602 -1.232651
C  0.042927 -0.655813 0.497264
C  -1.269075 -0.063443 0.095287
C  -2.294379 0.269611 0.98169
C  -1.84208 0.132793 -1.215756
C  -2.404292 0.272697 2.469173
H  4.493476 1.712633 -0.110123
H  4.134491 0.608479 -1.458492
H  3.247328 0.224146 1.485648
H  4.468061 -0.742551 0.616778
H  2.525696 2.522917 -1.523749
H  2.05979 2.226629 0.173041
H  2.746643 -1.602835 -0.95667
H  2.193756 -1.895942 0.730824
H  0.341742 1.280693 -1.318556
H  1.568605 0.352137 -2.234884
H  -1.388295 -0.061586 -2.187937
H  -2.35387 1.300984 2.872703
H  -3.36595 -0.165035 2.787975
H  -1.578408 -0.324887 2.884999
