program: Orca
programVersion: 5.0.2
elementType: S P O O O C C C C C C C C C C C C C H H H H H H H H H H H H H H H H H H H H H
charge: 0
multiplicity: 1
keywords: wb97x-d3
keywords: def2-TZVPP
keywords: def2/J RIJCOSX
keywords: DEFGRID2
keywords: scfconv7
keywords: smallprint printgap noloewdin
keywords: NOSOSCF
formula: C13H21O3PS
InChI: InChI=1/C13H21O3PS/c1-11(2)15-17(14,16-12(3)4)18-10-13-8-6-5-7-9-13/h5-9,11-12H,10H2,1-4H3
39 atoms
S  0.406772 1.199581 -1.238975
P  1.155486 -0.116133 0.210479
O  2.705643 -0.192458 -0.143188
O  0.774745 -1.586409 -0.252944
O  0.775734 0.314585 1.570908
C  3.574605 0.88244 0.26817
C  -0.583722 -2.069192 -0.174855
C  -0.873788 2.084169 -0.26657
C  4.26593 0.49349 1.559395
C  4.537009 1.138248 -0.871468
C  -0.76043 -3.054736 -1.30995
C  -0.833736 -2.684764 1.187507
C  -2.09753 1.260366 -0.008014
C  -2.945791 0.911016 -1.056527
C  -2.38754 0.802732 1.272833
C  -4.057119 0.116563 -0.831501
C  -3.503283 0.008183 1.499638
C  -4.337863 -0.340692 0.450037
H  2.981368 1.788679 0.436497
H  -1.275988 -1.23492 -0.325827
H  -1.10958 2.955235 -0.879961
H  -0.425149 2.439381 0.658293
H  4.857591 -0.413184 1.426408
H  4.937494 1.290535 1.879805
H  3.541611 0.323091 2.354688
H  5.13245 0.250636 -1.088376
H  5.219893 1.946258 -0.608428
H  4.005016 1.426981 -1.777436
H  -0.078396 -3.899984 -1.208188
H  -1.779966 -3.440048 -1.307492
H  -0.581563 -2.5805 -2.274393
H  -1.859126 -3.050792 1.242182
H  -0.696521 -1.953663 1.982386
H  -0.161513 -3.524969 1.366802
H  -2.7221 1.25058 -2.061044
H  -1.72371 1.047744 2.090646
H  -4.705937 -0.147752 -1.656222
H  -3.714638 -0.343576 2.50102
H  -5.205439 -0.962748 0.627043
totalener: -1473.47083528 hartree
nucrepener: 1765.78939909 hartree
electener: -3239.26023437 hartree
oneelecener: -5532.84846325 hartree
twoeener: 2293.58822888 hartree
kineticenergy: 1468.67198153 hartree
xcener: -107.911130403839 hartree
chargesum: 0.0000000
charge: -0.197976 0.793502 -0.335081 -0.316021 -0.535250 0.114965 0.194152 -0.094361 -0.245840 -0.213273 -0.225256 -0.268854 0.023736 -0.142652 -0.145203 -0.121520 -0.126154 -0.134729 0.056146 -0.004440 0.131506 0.124127 0.083381 0.079944 0.100028 0.085448 0.076340 0.090417 0.089597 0.075960 0.091863 0.082936 0.101116 0.094721 0.108891 0.127097 0.125842 0.128537 0.126359
qa: -0.1980 0.7935 -0.3351 -0.3160 -0.5353 0.1150 0.1942 -0.0944 -0.2458 -0.2133 -0.2253 -0.2689 0.0237 -0.1427 -0.1452 -0.1215 -0.1262 -0.1347 0.0561 -0.0044 0.1315 0.1241 0.0834 0.0799 0.1000 0.0854 0.0763 0.0904 0.0896 0.0760 0.0919 0.0829 0.1011 0.0947 0.1089 0.1271 0.1258 0.1285 0.1264
va: 2.2316 5.5884 2.1394 2.1570 2.0514 3.9181 3.8893 3.8462 3.9427 3.9164 3.9246 3.9333 3.6019 3.9418 3.9153 3.9509 3.9168 3.9366 1.0134 1.0242 0.9991 1.0295 1.0085 1.0086 1.0226 1.0105 1.0093 1.0140 1.0109 1.0099 1.0136 1.0089 1.0213 1.0128 1.0158 1.0267 1.0007 1.0010 0.9999
dispcorr: -0.021260437 hartree
energy: -1473.492095720433
dipole: 3.27338 -3.58034 -0.30697 -6.30546 6.45714 0.15168 2.40528 -2.71886 -0.31358
magnitude: 0.46429 au
magnitude: 1.18014 debye
