program: Gaussian 09
title: 000065882
version: EM64L-G09RevD.01
frameworkgroup: C1[X(C22H34N2O2)]
method: RPBEPBE
basis: SDD
operation: Freq
keyword: #p
keyword: freq=noraman
keyword: PBEPBE/SDD
title: #p freq=noraman PBEPBE/SDD
converged: YES YES NO NO
title: Mulliken charges:
elementType: O O N N C C C C C C C C C C C C C C C C C C C C C C H H H H H H H H H H H H H H H H H H H H H H H H H H H H H H H H H H
charge: -0.240552 -0.246160 -0.224790 -0.113786 -0.058381 -0.285377 -0.439999 -0.380601 -0.040293 -0.408916 -0.336464 -0.350799 -0.369258 0.210137 -0.356159 -0.432899 0.549990 -0.394526 -0.346426 -0.717111 -0.718425 -0.442175 -0.361444 -0.231873 -0.239536 -0.240484 0.228076 0.224432 0.251480 0.206582 0.233482 0.233610 0.202568 0.235244 0.203916 0.189382 0.198079 0.196036 0.187990 0.186732 0.213602 0.194048 0.183746 0.199060 0.206907 0.186675 0.201372 0.190673 0.184974 0.202317 0.240673 0.214387 0.217858 0.204435 0.224133 0.231113 0.253966 0.229076 0.228892 0.230790
chargesum: 0.00000
title: Mulliken charges with hydrogens summed into heavy atoms:
elementType: O O N N C C C C C C C C C C C C C C C C C C C C C C
charge: -0.240552 -0.246160 -0.224790 -0.113786 0.169695 -0.060945 0.018062 0.086491 0.162276 0.030244 0.050997 0.033227 0.031076 0.210137 0.021636 -0.026932 0.549990 -0.006479 0.029221 -0.059734 -0.071998 -0.211062 -0.107478 -0.002798 -0.010644 -0.009694
polarizability: 2.84283293e+02 2.09766103e+01 2.36942358e+02 -9.35282698e+00 5.82772639e+00 2.28589070e+02
1716.lowfreq: -24.2670 -13.0127 -4.5028 -1.8116 0.0004 0.0007 0.0009 11.1422 16.8947
frequency: -18.2930 -10.2781 16.4559 27.0508 34.7535 39.3507 49.2904 65.4329 84.9682 93.8096 104.5090 107.4003 158.4700 177.7566 198.2814 201.5913 211.8690 224.8796 229.4644 239.2352 243.9431 269.5373 297.6484 306.4065 319.5106 322.7598 347.1604 363.3312 375.5419 385.1797 401.1672 404.6311 435.2276 465.1145 487.7451 494.8178 518.2354 539.1753 569.5291 598.7794 615.2826 663.9106 694.5353 694.9777 704.4227 718.8774 746.1668 760.6830 773.2140 784.6552 791.9044 808.7783 831.1722 837.7026 855.6237 855.6609 861.1078 878.8454 889.0919 911.2020 921.4193 925.6483 933.1205 951.5188 963.9939 969.2281 972.6641 979.4199 989.7124 996.3725 1000.0191 1007.5687 1014.2535 1028.4958 1039.3083 1042.4794 1066.9661 1083.1378 1086.4456 1088.9588 1111.1896 1111.4011 1130.2914 1133.9884 1141.5020 1173.7241 1174.1951 1187.6074 1191.9413 1192.7536 1210.6910 1217.1450 1223.6437 1232.8026 1240.0213 1246.2080 1258.1072 1273.3380 1276.0120 1279.4595 1285.0044 1296.9144 1299.9665 1307.9631 1325.9919 1330.0010 1332.0311 1334.6190 1344.8000 1345.9811 1349.9387 1352.3735 1355.5502 1358.8437 1365.8870 1375.8069 1377.3723 1381.5973 1388.1610 1390.9304 1399.7462 1445.0842 1445.7454 1454.6899 1457.0463 1458.5667 1464.7677 1466.2916 1467.5319 1470.2632 1474.8873 1476.6985 1479.9187 1484.8383 1486.2071 1489.1100 1490.7165 1594.3842 1614.1006 1696.2981 2821.9149 2854.5324 2901.4934 2925.4485 2954.2550 2966.4066 2966.6863 2969.5776 2969.9309 2972.8136 2976.8920 2985.3452 2991.4297 2997.3741 3012.4439 3013.7958 3016.5375 3025.1580 3027.6532 3030.9273 3038.1716 3044.7027 3054.4809 3056.3989 3063.1111 3067.4853 3069.4921 3078.4865 3079.3903 3115.3148 3128.1053 3139.9135 3151.2698 3165.5503
redmass: 3.5832 3.7145 3.4911 4.4757 3.4453 4.1039 3.2075 4.0009 3.5002 3.7639 5.0390 3.5974 2.1944 3.3827 2.8340 2.7500 1.9281 1.9889 1.7776 1.2274 2.4953 2.7177 2.0249 4.4953 3.2007 3.4344 2.4271 2.3882 2.2346 3.1480 2.7774 2.3540 2.9187 3.4275 1.5951 2.9349 3.4534 2.4392 4.3435 3.4397 6.3919 6.4102 2.8863 5.0606 1.7199 4.3878 2.5876 2.1109 2.3279 1.8532 2.7825 1.5378 2.8465 2.0636 1.7513 1.2710 2.2474 2.2354 1.8486 1.7719 2.0095 2.0105 1.7179 1.9503 1.9466 2.0199 2.0892 1.4023 5.1104 1.8780 1.8287 1.5723 2.4486 2.1880 2.0815 2.0152 2.9101 1.8814 1.8458 1.9275 2.0079 1.9588 1.9666 2.0047 2.1257 1.0640 1.2266 2.1950 1.2483 1.6505 2.0406 1.4753 1.5431 1.3616 1.4254 1.9218 1.4737 1.2451 1.2439 1.3397 1.3377 1.3892 1.3910 1.4957 1.3768 1.3104 1.3729 1.3606 1.3682 1.3554 1.4829 1.4770 1.4199 1.4835 1.6240 1.4437 1.3216 1.2277 1.3514 3.6157 1.2311 1.0911 2.0768 1.0808 1.0812 1.0878 1.0762 1.0627 1.0795 1.0897 1.0800 1.0632 1.0704 2.1998 1.0669 1.0744 1.0848 5.9588 6.0606 11.2294 1.0724 1.0706 1.0694 1.0825 1.0606 1.0584 1.0405 1.0663 1.0685 1.0432 1.0634 1.0736 1.0722 1.0641 1.0974 1.0625 1.0875 1.0948 1.0962 1.0989 1.1010 1.0989 1.0994 1.0987 1.0973 1.0983 1.0893 1.1040 1.0995 1.0877 1.0863 1.0914 1.0959 1.1014
irintensity: 0.7802 0.4410 0.0958 0.3060 0.1115 0.7095 0.1213 1.0478 1.3325 0.8282 1.4763 0.1464 0.4335 0.6957 0.9182 0.4317 0.5996 2.9083 0.1581 0.0105 0.4472 3.1311 0.1662 2.1662 5.5809 1.8232 2.0739 0.5704 1.8242 3.2071 0.2580 4.1247 6.3014 10.4739 1.0749 1.9115 3.1906 0.6644 10.2653 3.6043 0.2530 17.1325 6.2270 12.6980 49.3339 16.1291 12.6262 8.7023 39.1667 12.3591 3.2866 3.7483 3.3624 8.9893 9.9398 0.8075 0.9139 7.8445 6.2382 23.8744 40.0113 18.7005 21.3507 45.3773 21.4951 1.0600 12.0366 0.3453 1.5279 2.9066 2.5681 3.6929 19.0740 9.3504 3.3150 26.2448 3.2219 33.7094 12.1686 13.4195 30.5456 4.8993 43.6684 4.1293 11.4486 1.0918 8.1504 14.5124 4.5390 6.1825 22.6987 16.0656 9.6175 4.9202 3.2638 36.9677 84.2374 2.8592 6.7761 6.4063 6.4996 12.3848 19.0236 8.5905 26.4744 7.1015 19.3525 5.5752 4.9941 2.5019 7.3896 23.3773 3.0696 23.1989 68.7970 6.8443 3.7652 15.5021 1.7360 0.9140 14.0217 7.0233 11.5277 3.2525 1.6496 10.4924 2.8880 5.5602 3.0787 9.6741 23.2527 2.1405 22.3672 11.9432 12.9670 22.5024 13.9095 0.3962 0.7006 466.6084 105.6726 131.7764 103.5847 34.0982 26.6929 64.9676 30.9238 20.7987 25.2204 22.5361 30.4513 12.4804 25.7839 22.1598 61.0329 21.0336 11.5999 71.3668 33.7609 20.8109 173.2972 36.3836 16.5095 12.2022 67.9620 72.4686 23.4894 22.9280 38.4537 8.9070 0.3030 16.8539 29.2796 20.4603
temp: 298.150 k
press: 1.00000 atm
elementType: 8 8 7 7 6 6 6 6 6 6 6 6 6 6 6 6 6 6 6 6 6 6 6 6 6 6 1 1 1 1 1 1 1 1 1 1 1 1 1 1 1 1 1 1 1 1 1 1 1 1 1 1 1 1 1 1 1 1 1 1
symmnumber: 1
zpe: 1372736.9 jmol-1
zpe.correction: 0.522848 hartree
zpe.thermalcorrener: 0.547628 hartree
zpe.thermalcorrenthalpy: 0.548572 hartree
zpe.thermalcorrgfe: 0.467100 hartree
zpe.sumelectzpe: -1116.662807 hartree
zpe.sumelectthermal: -1116.638027 hartree
zpe.sumelectthermalent: -1116.637083 hartree
zpe.sumelectthermalfe: -1116.718555 hartree
dipole: 2.6262 -5.9217 0.4188
dipole: 6.4914
quadrupole: -148.5250 -178.3556 -151.9810
quadrupole: 18.2246 -4.1727 6.5178
quadrupole: 11.0955 -18.7351 7.6396 18.2246 -4.1727 6.5178
hfenergy: -1117.1856547 hartree
pointgroup: C01 [X(C22H34N2O2)]
dipole: 0.8789943 -2.3590962 -0.4295553 debye
polarizability: 284.9022463|20.5656833|232.0448809|-9.8434826|5.1686873|232.8675947 unknown
InChI: InChI=1S/C22H34N2O2/c1-18(2)17-20-21(19-11-6-5-7-12-19)26-22(25)24(20)16-10-15-23-13-8-3-4-9-14-23/h5-7,11-12,18,20-21H,3-4,8-10,13-17H2,1-2H3
charge 0 multiplicity 1
60 atoms
O  -2.510989 2.256411 -0.43654
O  -0.850858 3.696445 0.390863
N  -0.438769 1.388135 -0.000725
N  3.875167 0.542701 -0.369021
C  -1.127417 0.298362 -0.748486
C  -2.628552 0.765064 -0.619149
C  -0.788951 -1.126495 -0.250703
C  1.015969 1.470148 0.210191
C  -0.884185 -2.24784 -1.32918
C  1.816737 1.839467 -1.060216
C  3.337628 1.864851 -0.772499
C  4.997927 0.561635 0.604715
C  4.037369 -0.372462 -1.521374
C  -1.199466 2.553793 0.028615
C  4.775055 -0.436425 1.768511
C  4.610799 -1.766009 -1.167166
C  -3.464915 0.190569 0.512187
C  4.907238 -1.930885 1.393513
C  4.087278 -2.380478 0.156907
C  -2.277137 -2.335792 -1.997418
C  0.235994 -2.135257 -2.392619
C  -4.670158 -0.489576 0.211662
C  -3.090663 0.35368 1.871957
C  -5.485537 -1.007944 1.243112
C  -3.90356 -0.160934 2.903524
C  -5.102706 -0.846388 2.593491
H  -0.848016 0.376704 -1.822956
H  -3.155969 0.624226 -1.576254
H  -1.436012 -1.379941 0.608301
H  0.251201 -1.125739 0.128894
H  1.396198 0.515956 0.612966
H  1.17931 2.246996 0.979603
H  -0.721211 -3.200979 -0.783678
H  1.505427 2.841874 -1.412204
H  1.59404 1.124091 -1.875566
H  3.867678 2.271004 -1.671347
H  3.518102 2.579083 0.0535
H  5.064487 1.579772 1.032762
H  5.981251 0.365612 0.115378
H  4.687541 0.085601 -2.313729
H  3.039641 -0.508697 -1.983211
H  3.761613 -0.242422 2.17182
H  5.49817 -0.209972 2.580106
H  5.71662 -1.718129 -1.114732
H  4.376695 -2.437753 -2.016688
H  5.975411 -2.164648 1.198679
H  4.611849 -2.540768 2.271139
H  3.01822 -2.122014 0.297158
H  4.145476 -3.485009 0.086942
H  -2.483989 -1.441044 -2.615975
H  -3.079257 -2.425427 -1.243324
H  -2.33337 -3.215116 -2.665374
H  0.187158 -2.981898 -3.102251
H  0.147691 -1.205005 -2.986317
H  1.236539 -2.145092 -1.920384
H  -4.980661 -0.602049 -0.834939
H  -2.170005 0.892319 2.121377
H  -6.418087 -1.526491 0.99425
H  -3.607172 -0.023282 3.949329
H  -5.734768 -1.241542 3.396575
