program: Orca
programVersion: 5.0.2
elementType: S P O O O C C C C C C C C C C C C C H H H H H H H H H H H H H H H H H H H H H
charge: 0
multiplicity: 1
keywords: wb97x-d3
keywords: def2-TZVPP
keywords: def2/J RIJCOSX
keywords: DEFGRID2
keywords: scfconv7
keywords: smallprint printgap noloewdin
keywords: NOSOSCF
formula: C13H21O3PS
InChI: InChI=1/C13H21O3PS/c1-11(2)15-17(14,16-12(3)4)18-10-13-8-6-5-7-9-13/h5-9,11-12H,10H2,1-4H3
39 atoms
S  -0.092552 0.099821 -1.707691
P  0.313628 -1.117045 -0.054635
O  0.811042 -0.198874 1.134572
O  1.658579 -1.826809 -0.551476
O  -0.80881 -1.994654 0.319078
C  1.568941 1.021443 1.058613
C  1.571951 -2.954986 -1.450081
C  -1.848928 0.493341 -1.353994
C  1.222337 1.816686 2.299495
C  3.051553 0.721605 0.949727
C  2.716137 -2.828291 -2.432541
C  1.610285 -4.23755 -0.64388
C  -2.040084 1.395048 -0.173073
C  -2.509586 0.88603 1.032803
C  -1.757839 2.755864 -0.266807
C  -2.71504 1.726089 2.118513
C  -1.958571 3.594217 0.817197
C  -2.443449 3.081187 2.013554
H  1.241011 1.578766 0.175488
H  0.626463 -2.906267 -2.002063
H  -2.386813 -0.445253 -1.233258
H  -2.205578 0.966293 -2.269877
H  1.739795 2.77597 2.280531
H  0.152239 2.012026 2.352295
H  1.525783 1.287211 3.20389
H  3.613253 1.65635 0.953469
H  3.295953 0.190064 0.031196
H  3.391995 0.120838 1.794128
H  2.693647 -3.65809 -3.139176
H  2.645413 -1.901228 -3.001264
H  3.679132 -2.84836 -1.920529
H  2.537009 -4.314346 -0.073732
H  1.550888 -5.099821 -1.308748
H  0.769802 -4.287116 0.046861
H  -2.704837 -0.174677 1.124733
H  -1.379191 3.161339 -1.198035
H  -3.084725 1.316485 3.049371
H  -1.740938 4.650639 0.728747
H  -2.604363 3.736154 2.859835
totalener: -1473.46921668 hartree
nucrepener: 1769.81193257 hartree
electener: -3243.28114925 hartree
oneelecener: -5540.86762708 hartree
twoeener: 2297.58647783 hartree
kineticenergy: 1468.66505648 hartree
xcener: -107.910967516431 hartree
chargesum: -0.0000000
charge: -0.207880 0.796882 -0.307928 -0.348498 -0.527498 0.111913 0.106859 -0.096466 -0.208478 -0.228693 -0.222603 -0.242333 0.029301 -0.129277 -0.168912 -0.125350 -0.128855 -0.130564 0.060262 0.064424 0.135809 0.129121 0.074616 0.082285 0.089134 0.081140 0.086161 0.087646 0.081949 0.090101 0.083015 0.080205 0.079342 0.104964 0.132323 0.111545 0.125977 0.123529 0.124833
qa: -0.2079 0.7969 -0.3079 -0.3485 -0.5275 0.1119 0.1069 -0.0965 -0.2085 -0.2287 -0.2226 -0.2423 0.0293 -0.1293 -0.1689 -0.1254 -0.1289 -0.1306 0.0603 0.0644 0.1358 0.1291 0.0746 0.0823 0.0891 0.0811 0.0862 0.0876 0.0819 0.0901 0.0830 0.0802 0.0793 0.1050 0.1323 0.1115 0.1260 0.1235 0.1248
va: 2.2271 5.5655 2.1294 2.1062 2.1010 3.8742 3.9067 3.8525 3.9018 3.9413 3.9113 3.9372 3.5678 3.9437 3.9600 3.9322 3.9330 3.9212 1.0221 1.0138 1.0221 0.9974 1.0103 1.0196 1.0140 1.0100 1.0194 1.0114 1.0113 1.0113 1.0095 1.0082 1.0089 1.0235 1.0265 1.0123 1.0019 1.0014 1.0010
dispcorr: -0.021256190 hartree
energy: -1473.490472873636
dipole: 11.99295 -11.41424 0.57871 -0.57763 1.31241 0.73478 1.88205 -2.34939 -0.46733
magnitude: 1.04556 au
magnitude: 2.65761 debye
