program: Gaussian 09
title: 000065905
version: EM64L-G09RevD.01
frameworkgroup: C1[X(C15H25N5O3)]
method: RPBEPBE
basis: SDD
operation: Freq
keyword: #p
keyword: freq=noraman
keyword: PBEPBE/SDD
title: #p freq=noraman PBEPBE/SDD
converged: YES YES NO NO
title: Mulliken charges:
elementType: O O O N N N N N C C C C C C C C C C C C C C C H H H H H H H H H H H H H H H H H H H H H H H H H
charge: -0.248782 -0.304984 -0.289230 -0.167488 -0.065208 -0.077834 -0.062342 -0.590629 -0.062447 -0.272315 -0.288523 -0.329661 0.076015 0.075109 0.180143 -0.681920 -0.694721 -0.696649 -0.681880 -0.209839 0.012004 -0.314403 -0.003033 0.251749 0.231750 0.187805 0.214264 0.179010 0.217630 0.272856 0.173930 0.169807 0.221467 0.224007 0.210350 0.219014 0.229740 0.200577 0.226377 0.200120 0.224865 0.229681 0.219686 0.209924 0.265867 0.257545 0.333440 0.327157
chargesum: 0.00000
title: Mulliken charges with hydrogens summed into heavy atoms:
elementType: O O O N N N N N C C C C C C C C C C C C C C C
charge: -0.248782 -0.304984 -0.289230 -0.167488 -0.065208 -0.077834 -0.062342 0.069969 0.189303 0.147239 0.104751 0.160826 0.249945 0.244916 0.180143 -0.026097 -0.045390 -0.045286 -0.022590 0.056027 0.012004 -0.056858 -0.003033
polarizability: 2.25859571e+02 -1.24837831e+01 1.95434683e+02 -1.88863442e+01 -2.14637347e+01 2.09964197e+02
1716.lowfreq: -2.8670 -0.0005 -0.0004 0.0003 4.0115 7.9045 13.6716 14.9736 21.3554
frequency: 13.3308 14.3637 21.3268 23.8271 31.1129 36.9812 55.8287 67.0034 91.9226 116.9536 126.2580 140.7928 150.2228 170.6770 175.2729 188.2788 204.6016 210.5890 233.8258 237.3811 260.4838 286.2228 324.5567 330.1710 354.5285 357.6250 373.9645 396.9284 411.8051 425.7608 440.4521 457.8134 461.2608 476.9298 484.4712 499.6156 526.7527 532.1275 594.2923 630.7294 652.7339 704.5006 720.8878 758.3393 762.6638 789.1131 792.9421 812.7674 822.0907 826.4245 879.0874 896.7231 907.1247 916.6080 919.3064 919.7891 934.8104 935.2177 940.4282 961.0420 986.8317 1011.1122 1025.9093 1037.2240 1058.1608 1072.3328 1080.5379 1114.1527 1118.4155 1129.5457 1146.1123 1146.9825 1175.3301 1177.9247 1178.2171 1202.1094 1215.8762 1222.8411 1261.5088 1287.2468 1293.6649 1307.8349 1313.4603 1315.7934 1325.1935 1328.8585 1330.3864 1332.2029 1364.5505 1371.4541 1373.8859 1383.3861 1390.1757 1391.3064 1392.7728 1393.6789 1405.6632 1439.3486 1454.6905 1455.5436 1455.7785 1460.0017 1464.3158 1465.8007 1467.8553 1471.2643 1471.6411 1486.5726 1487.1054 1498.8885 1532.5448 1589.1806 1605.9212 2912.6578 2921.6597 2923.6342 2938.4888 2983.2296 2983.8108 2989.0454 2989.9295 2990.1460 3006.2779 3034.7940 3047.6426 3077.7153 3078.1411 3086.0262 3087.3702 3091.3767 3093.3529 3096.5093 3097.9928 3107.9803 3149.8388 3227.7827 3563.5343 3723.0417
redmass: 2.8998 5.1636 4.5816 2.6281 4.4971 3.7483 3.9945 3.8734 5.6498 2.5982 3.2886 3.9526 2.5887 2.3080 1.2618 1.4808 3.3389 2.2269 1.2268 1.5265 3.3228 3.0720 2.9002 3.2801 2.7233 3.1669 2.9378 2.8627 3.0522 2.3572 2.4975 1.8010 2.2814 3.6243 3.7559 3.1352 1.0521 4.6571 5.3207 4.2464 4.1502 7.5297 6.9532 5.2362 4.6455 3.1465 4.8682 8.1710 2.9535 1.7092 2.6776 2.6401 3.4606 1.2461 1.2278 1.6318 1.3813 1.3881 1.4713 2.9779 5.2147 3.0974 6.2534 2.2057 2.4966 3.3730 4.2256 1.8812 1.9516 2.1074 2.0584 2.0059 2.1202 1.9357 1.9407 1.7492 1.3155 1.1531 1.8170 1.2984 6.0822 2.0353 1.2187 1.8853 1.2839 1.4759 1.5081 2.8793 1.2396 1.3106 1.2824 1.3535 1.2879 1.2925 1.2807 1.3402 3.2493 2.7134 1.0520 1.0698 1.0505 1.0658 1.1946 1.1182 1.0729 1.0517 1.0516 1.0506 1.0518 2.6423 8.9951 5.7154 1.6713 1.0826 1.0650 1.0841 1.0650 1.0356 1.0361 1.0851 1.0361 1.0358 1.0956 1.0562 1.0955 1.0989 1.0989 1.1001 1.1005 1.0995 1.0997 1.1000 1.1000 1.1111 1.0937 1.0984 1.0440 1.1060
irintensity: 0.7425 0.1488 0.4940 0.1806 0.4715 0.1402 0.2996 0.9288 1.8490 4.6019 2.6020 3.5580 1.7388 0.3836 0.9828 1.5013 1.2981 2.3330 0.2041 1.4735 1.5325 1.2997 5.6988 0.7833 14.1417 1.9598 0.8448 6.4424 2.8526 76.5776 52.9388 99.9400 70.7835 2.0392 5.6123 9.4697 3.2912 7.7850 11.9252 18.6112 2.1911 31.6026 31.3670 11.2098 3.8323 6.0914 23.1596 18.5818 28.5814 7.7119 4.4514 9.1792 15.6464 2.6313 1.7152 1.6921 0.3224 0.9642 13.0296 15.9575 298.5928 31.6216 181.5072 4.2478 17.7908 38.0303 6.8152 99.4909 53.5070 31.5532 13.1034 20.7342 56.0070 9.8245 20.8412 22.0858 6.3979 14.1243 16.9189 18.0532 47.2623 12.4691 53.0487 2.4937 9.8076 15.2256 7.8464 66.0317 14.5196 21.2856 14.8307 21.8342 42.0471 8.0221 12.3667 19.5614 40.7546 81.2026 8.6166 1.8195 7.7949 3.2406 37.3775 19.5196 0.9183 5.9738 7.9998 19.4978 19.7910 74.3110 90.1338 96.4283 497.8519 36.2332 68.1780 46.3302 75.1597 18.7182 15.7609 7.9922 23.9937 17.8773 45.9038 27.2692 22.4690 30.9271 20.7422 25.7538 15.8116 65.4268 52.8009 38.2934 34.4915 6.7699 13.6767 0.0226 117.4465 50.3163
temp: 298.150 k
press: 1.00000 atm
elementType: 8 8 8 7 7 7 7 7 6 6 6 6 6 6 6 6 6 6 6 6 6 6 6 1 1 1 1 1 1 1 1 1 1 1 1 1 1 1 1 1 1 1 1 1 1 1 1 1
symmnumber: 1
zpe: 1043506.8 jmol-1
zpe.correction: 0.397451 hartree
zpe.thermalcorrener: 0.422531 hartree
zpe.thermalcorrenthalpy: 0.423475 hartree
zpe.thermalcorrgfe: 0.337929 hartree
zpe.sumelectzpe: -1084.213321 hartree
zpe.sumelectthermal: -1084.188241 hartree
zpe.sumelectthermalent: -1084.187297 hartree
zpe.sumelectthermalfe: -1084.272843 hartree
dipole: -3.6414 2.1091 -2.7736
dipole: 5.0399
quadrupole: -148.0196 -129.3938 -127.4779
quadrupole: 7.1123 -3.5168 1.9433
quadrupole: -13.0559 5.5700 7.4859 7.1123 -3.5168 1.9433
hfenergy: -1084.6107719 hartree
pointgroup: C01 [X(C15H25N5O3)]
dipole: -1.7244251 0.6616359 0.7213195 debye
polarizability: 226.7112787|-5.0296193|172.3716658|7.8352595|-4.992444|232.1755073 unknown
InChI: InChI=1S/C15H25N5O3/c1-10(2)21-6-12(7-22-11(3)4)23-9-20-8-18-13-5-17-15(16)19-14(13)20/h5,8,10-12H,6-7,9,16H2,1-4H3
charge 0 multiplicity 1
48 atoms
O  -0.432326 -0.04498 -1.297699
O  -2.612623 -0.847964 0.530308
O  -1.546136 2.789596 -1.30405
N  1.500302 -1.382386 -0.653927
N  3.779686 -1.452254 -1.014886
N  1.49806 -1.0138 1.795561
N  3.787375 -0.923031 2.730655
N  1.892983 -0.702248 4.090951
C  -0.925708 0.742073 -0.132399
C  -2.432722 0.524537 0.036855
C  -0.570949 2.210991 -0.376675
C  0.058516 -1.370563 -0.961415
C  -4.026442 -1.238608 0.73965
C  -1.302023 4.215253 -1.624675
C  2.0983 -1.20537 0.597012
C  -4.759018 -1.463454 -0.598572
C  -3.976699 -2.506089 1.60156
C  -2.609935 4.721952 -2.244368
C  -0.096505 4.382626 -2.57145
C  2.564764 -1.514624 -1.575907
C  3.51246 -1.25828 0.36119
C  4.334502 -1.104932 1.498636
C  2.402616 -0.888184 2.825772
H  -0.401469 0.394737 0.781675
H  -2.931761 0.682691 -0.936515
H  -2.84458 1.251725 0.77196
H  0.45874 2.257104 -0.784808
H  -0.59774 2.765621 0.589416
H  -0.096314 -1.985424 -1.862944
H  -0.487545 -1.792045 -0.100515
H  -4.531621 -0.421379 1.304773
H  -1.103627 4.760791 -0.672078
H  -4.251831 -2.255172 -1.178777
H  -4.786965 -0.546825 -1.21393
H  -5.8032 -1.778269 -0.415262
H  -3.442492 -3.309978 1.06366
H  -3.442612 -2.30962 2.546799
H  -4.997168 -2.859815 1.834962
H  -3.450077 4.5813 -1.542698
H  -2.53233 5.795178 -2.495293
H  -2.83362 4.160149 -3.168809
H  -0.26457 3.807427 -3.499129
H  0.844159 4.030735 -2.111868
H  0.037318 5.447821 -2.836615
H  2.37514 -1.652215 -2.639075
H  5.427625 -1.124705 1.437737
H  2.540488 -0.612354 4.868701
H  0.886674 -0.693738 4.229808
