program: Orca
programVersion: 5.0.2
elementType: I O O N C C C C C C C C H H H H H H H H H H H H
elementType: I
charge: 0
multiplicity: 1
keywords: wb97x-d3
keywords: def2-TZVPP
keywords: def2/J RIJCOSX
keywords: DEFGRID2
keywords: scfconv7
keywords: smallprint printgap noloewdin
keywords: NOSOSCF
formula: C8H12INO2
InChI: InChI=1/C8H12INO2/c1-2-3-6-10-8(11)12-7-4-5-9/h10H,2-3,6-7H2,1H3
24 atoms
I  2.796703 0.318853 0.570305
O  -2.200272 1.393405 -1.032425
O  -2.443086 0.737041 1.113953
N  -3.678021 -0.187268 -0.556881
C  -3.403546 -2.418334 0.572945
C  -3.184785 -3.407374 -0.567883
C  -4.29242 -1.219858 0.256628
C  -2.433662 -2.86499 -1.777041
C  -2.751394 0.637852 -0.059827
C  -1.217909 2.335723 -0.621272
C  0.035424 1.693451 -0.249478
C  1.078169 1.172568 0.052204
H  -3.876539 -2.952437 1.401325
H  -2.439018 -2.070058 0.953609
H  -4.152369 -3.804835 -0.888794
H  -2.63071 -4.259561 -0.166253
H  -4.638263 -0.764926 1.185058
H  -5.18686 -1.549107 -0.272713
H  -1.519979 -2.345368 -1.482223
H  -2.147256 -3.67655 -2.446938
H  -3.034264 -2.170916 -2.365102
H  -3.763623 -0.255771 -1.558905
H  -1.060511 2.985098 -1.482339
H  -1.581269 2.961455 0.196812
elementType: I O N C H
totalener: -815.07975521 hartree
nucrepener: 824.69074920 hartree
electener: -1639.77050441 hartree
oneelecener: -2859.36196451 hartree
twoeener: 1219.59146010 hartree
cpcmener: -0.03061351 hartree
kineticenergy: 628.60308003 hartree
xcener: -65.067209508228 hartree
chargesum: -0.0000000
charge: 0.297056 -0.322694 -0.556979 -0.229630 -0.130082 -0.094104 -0.043898 -0.279984 0.529938 0.009506 -0.369126 -0.006069 0.079009 0.070868 0.054150 0.068811 0.103839 0.104848 0.081518 0.095109 0.077272 0.183335 0.135156 0.142153
qa: 0.2971 -0.3227 -0.5570 -0.2296 -0.1301 -0.0941 -0.0439 -0.2800 0.5299 0.0095 -0.3691 -0.0061 0.0790 0.0709 0.0542 0.0688 0.1038 0.1048 0.0815 0.0951 0.0773 0.1833 0.1352 0.1422
va: 1.2203 2.0713 1.9389 3.2116 3.8606 3.8856 3.8710 3.9448 4.2715 3.9198 4.0355 3.8270 1.0129 1.0209 1.0083 1.0052 1.0123 1.0009 1.0018 1.0039 1.0007 1.0101 0.9884 0.9985
dispcorr: -0.009194374 hartree
energy: -815.088949586245
dipole: -237.10793 236.67890 -0.42903 -38.81280 38.23739 -0.57541 -41.30687 40.04474 -1.26213
magnitude: 1.45195 au
magnitude: 3.69055 debye
