program: Orca
programVersion: 5.0.2
elementType: I O O N C C C C C C C C H H H H H H H H H H H H
elementType: I
charge: 0
multiplicity: 1
keywords: wb97x-d3
keywords: def2-TZVPP
keywords: def2/J RIJCOSX
keywords: DEFGRID2
keywords: scfconv7
keywords: smallprint printgap noloewdin
keywords: NOSOSCF
formula: C8H12INO2
InChI: InChI=1/C8H12INO2/c1-2-3-6-10-8(11)12-7-4-5-9/h10H,2-3,6-7H2,1H3
24 atoms
I  2.51964 -0.22641 0.326974
O  -2.225602 1.819905 -0.881314
O  -2.541595 1.004211 1.199685
N  -3.667289 0.162169 -0.588865
C  -3.295002 -2.102471 0.446552
C  -2.561917 -2.716639 -0.748382
C  -4.252934 -0.964044 0.113502
C  -1.261028 -2.019801 -1.133363
C  -2.791254 0.978156 0.00926
C  -1.114015 2.575749 -0.413761
C  0.038886 1.720144 -0.165252
C  0.975409 0.985728 0.017343
H  -3.901648 -2.870668 0.932889
H  -2.569128 -1.778079 1.197236
H  -3.232651 -2.755898 -1.612621
H  -2.327649 -3.756697 -0.509665
H  -4.729967 -0.604518 1.02597
H  -5.052933 -1.338903 -0.523995
H  -0.747976 -2.568717 -1.9247
H  -1.412938 -1.004196 -1.497057
H  -0.580251 -1.966666 -0.280888
H  -3.641965 0.115738 -1.596638
H  -0.887349 3.283246 -1.21096
H  -1.365003 3.155312 0.477054
elementType: I O N C H
totalener: -815.07939555 hartree
nucrepener: 854.19333018 hartree
electener: -1669.27272573 hartree
oneelecener: -2918.37437152 hartree
twoeener: 1249.10164579 hartree
cpcmener: -0.02997799 hartree
kineticenergy: 628.60109546 hartree
xcener: -65.066630313658 hartree
chargesum: -0.0000000
charge: 0.305125 -0.318750 -0.542473 -0.231104 -0.110613 -0.109426 -0.061012 -0.265690 0.506110 0.022147 -0.375598 -0.011195 0.084548 0.067265 0.064744 0.073256 0.103653 0.104109 0.098351 0.066654 0.068366 0.185365 0.135920 0.140247
qa: 0.3051 -0.3187 -0.5425 -0.2311 -0.1106 -0.1094 -0.0610 -0.2657 0.5061 0.0221 -0.3756 -0.0112 0.0845 0.0673 0.0647 0.0733 0.1037 0.1041 0.0984 0.0667 0.0684 0.1854 0.1359 0.1402
va: 1.2229 2.0681 1.9564 3.1952 3.8006 3.8854 3.9123 3.9333 4.3108 3.9039 4.0397 3.8125 1.0135 1.0232 1.0082 1.0056 1.0102 1.0015 1.0060 1.0121 1.0008 1.0053 0.9885 0.9998
dispcorr: -0.010972232 hartree
energy: -815.090367781900
dipole: -213.61280 213.43844 -0.17436 2.51130 -3.18991 -0.67861 -26.66630 25.29300 -1.37330
magnitude: 1.54171 au
magnitude: 3.91872 debye
