program: Orca
programVersion: 5.0.2
elementType: I O O N C C C C C C C C H H H H H H H H H H H H
elementType: I
charge: 0
multiplicity: 1
keywords: wb97x-d3
keywords: def2-TZVPP
keywords: def2/J RIJCOSX
keywords: DEFGRID2
keywords: scfconv7
keywords: smallprint printgap noloewdin
keywords: NOSOSCF
formula: C8H12INO2
InChI: InChI=1/C8H12INO2/c1-2-3-6-10-8(11)12-7-4-5-9/h10H,2-3,6-7H2,1H3
24 atoms
I  3.053789 1.108294 -0.676805
O  -2.140459 0.674321 0.536756
O  -2.086771 -0.614562 -1.316801
N  -2.759377 -1.44214 0.69527
C  -4.705878 -2.713012 -0.170107
C  -5.197595 -4.052606 -0.708848
C  -3.23401 -2.726543 0.220813
C  -5.085212 -5.202881 0.282884
C  -2.320415 -0.485537 -0.12907
C  -1.525489 1.738072 -0.177827
C  -0.09624 1.519669 -0.360916
C  1.092426 1.36778 -0.482044
H  -4.864042 -1.939773 -0.927011
H  -5.303617 -2.426052 0.700759
H  -4.648751 -4.301662 -1.62192
H  -6.242779 -3.93953 -1.006731
H  -2.618132 -3.042897 -0.621584
H  -3.055874 -3.444611 1.020191
H  -5.601953 -4.9729 1.216867
H  -5.530044 -6.112293 -0.122556
H  -4.048671 -5.436017 0.529674
H  -2.991224 -1.183059 1.642466
H  -2.012714 1.91352 -1.139148
H  -1.68231 2.626419 0.43387
elementType: I O N C H
totalener: -815.08204975 hartree
nucrepener: 787.44827388 hartree
electener: -1602.53032363 hartree
oneelecener: -2784.80384093 hartree
twoeener: 1182.27351731 hartree
cpcmener: -0.03033139 hartree
kineticenergy: 628.59514534 hartree
xcener: -65.065654595671 hartree
chargesum: 0.0000000
charge: 0.296912 -0.323702 -0.560431 -0.234124 -0.117621 -0.108446 -0.024034 -0.278065 0.526024 0.010102 -0.368027 -0.005231 0.078391 0.070388 0.060703 0.069650 0.089391 0.107866 0.081663 0.091591 0.081388 0.180127 0.140505 0.134980
qa: 0.2969 -0.3237 -0.5604 -0.2341 -0.1176 -0.1084 -0.0240 -0.2781 0.5260 0.0101 -0.3680 -0.0052 0.0784 0.0704 0.0607 0.0697 0.0894 0.1079 0.0817 0.0916 0.0814 0.1801 0.1405 0.1350
va: 1.2170 2.0762 1.9362 3.2170 3.8723 3.9024 3.8425 3.9337 4.2790 3.9228 4.0529 3.8191 1.0193 1.0135 1.0076 1.0064 1.0168 1.0011 0.9995 1.0041 0.9975 1.0125 1.0004 0.9882
dispcorr: -0.007998083 hartree
energy: -815.090047834294
dipole: -271.76897 271.27546 -0.49351 -118.93685 118.76821 -0.16864 25.90957 -24.52351 1.38606
magnitude: 1.48093 au
magnitude: 3.76423 debye
