program: Orca
programVersion: 5.0.2
elementType: I O O N C C C C C C C C H H H H H H H H H H H H
elementType: I
charge: 0
multiplicity: 1
keywords: wb97x-d3
keywords: def2-TZVPP
keywords: def2/J RIJCOSX
keywords: DEFGRID2
keywords: scfconv7
keywords: smallprint printgap noloewdin
keywords: NOSOSCF
formula: C8H12INO2
InChI: InChI=1/C8H12INO2/c1-2-3-6-10-8(11)12-7-4-5-9/h10H,2-3,6-7H2,1H3
24 atoms
I  2.893684 1.085916 0.962483
O  -2.069925 0.599029 -0.942312
O  -2.232415 -0.392129 1.079293
N  -2.703692 -1.520559 -0.840259
C  -4.708179 -2.680942 0.054025
C  -5.226221 -3.921601 0.774788
C  -3.209961 -2.726383 -0.215775
C  -5.024958 -5.218252 0.002117
C  -2.339172 -0.446492 -0.132467
C  -1.522576 1.756506 -0.32435
C  -0.145459 1.546843 0.102641
C  1.002013 1.377643 0.426115
H  -5.239313 -2.560078 -0.895295
H  -4.933459 -1.794865 0.654038
H  -6.291941 -3.784551 0.972574
H  -4.745006 -4.000793 1.754077
H  -2.963506 -3.5548 -0.878797
H  -2.662205 -2.899485 0.711193
H  -3.969795 -5.472408 -0.108379
H  -5.504648 -6.055168 0.511271
H  -5.454524 -5.153427 -0.999942
H  -2.840497 -1.414439 -1.834195
H  -1.555931 2.534766 -1.086886
H  -2.136454 2.093445 0.513613
elementType: I O N C H
totalener: -815.08198179 hartree
nucrepener: 790.13526457 hartree
electener: -1605.21724636 hartree
oneelecener: -2790.22951358 hartree
twoeener: 1185.01226721 hartree
cpcmener: -0.03044505 hartree
kineticenergy: 628.59549238 hartree
xcener: -65.065815904842 hartree
chargesum: -0.0000000
charge: 0.296469 -0.323913 -0.560921 -0.233638 -0.119172 -0.107008 -0.024304 -0.278722 0.526981 0.011988 -0.365161 -0.009087 0.070262 0.078795 0.069315 0.060495 0.108339 0.089186 0.082189 0.091570 0.081327 0.180456 0.134248 0.140307
qa: 0.2965 -0.3239 -0.5609 -0.2336 -0.1192 -0.1070 -0.0243 -0.2787 0.5270 0.0120 -0.3652 -0.0091 0.0703 0.0788 0.0693 0.0605 0.1083 0.0892 0.0822 0.0916 0.0813 0.1805 0.1342 0.1403
va: 1.2175 2.0771 1.9344 3.2189 3.8716 3.9007 3.8407 3.9339 4.2760 3.9224 4.0419 3.8264 1.0137 1.0198 1.0064 1.0077 1.0010 1.0170 0.9972 1.0042 0.9995 1.0124 0.9887 0.9994
dispcorr: -0.008039709 hartree
energy: -815.090021501659
dipole: -264.59035 264.24421 -0.34614 -116.79420 116.38440 -0.40980 -44.29741 42.93105 -1.36636
magnitude: 1.46789 au
magnitude: 3.73107 debye
