program: Orca
programVersion: 5.0.2
elementType: I O O N C C C C C C C C H H H H H H H H H H H H
elementType: I
charge: 0
multiplicity: 1
keywords: wb97x-d3
keywords: def2-TZVPP
keywords: def2/J RIJCOSX
keywords: DEFGRID2
keywords: scfconv7
keywords: smallprint printgap noloewdin
keywords: NOSOSCF
formula: C8H12INO2
InChI: InChI=1/C8H12INO2/c1-2-3-6-10-8(11)12-7-4-5-9/h10H,2-3,6-7H2,1H3
24 atoms
I  3.198922 1.114429 0.020025
O  -2.142498 0.687863 -0.075923
O  -1.616687 -1.075201 -1.383643
N  -2.940101 -1.301605 0.45975
C  -4.83986 -2.761321 -0.11431
C  -5.343485 -4.195985 -0.227762
C  -3.364596 -2.670952 0.251195
C  -4.749082 -4.967766 -1.397212
C  -2.196447 -0.61755 -0.416329
C  -1.34103 1.5311 -0.89259
C  0.080602 1.372479 -0.61706
C  1.258399 1.275919 -0.383825
H  -5.012272 -2.23116 -1.056186
H  -5.420203 -2.236697 0.650325
H  -6.430954 -4.175043 -0.330109
H  -5.139035 -4.726842 0.707067
H  -2.738321 -3.109895 -0.522733
H  -3.175923 -3.238446 1.165144
H  -4.950018 -4.461791 -2.343677
H  -3.66783 -5.083306 -1.308881
H  -5.175673 -5.969248 -1.464467
H  -3.426946 -0.776809 1.172087
H  -1.544588 1.374282 -1.953778
H  -1.648685 2.548093 -0.649157
elementType: I O N C H
totalener: -815.08165571 hartree
nucrepener: 785.17544126 hartree
electener: -1600.25709698 hartree
oneelecener: -2780.24103027 hartree
twoeener: 1179.98393329 hartree
cpcmener: -0.03031403 hartree
kineticenergy: 628.59343624 hartree
xcener: -65.065299390095 hartree
chargesum: -0.0000000
charge: 0.296417 -0.323807 -0.558452 -0.226784 -0.111013 -0.104801 -0.014284 -0.273422 0.523471 0.006540 -0.369635 -0.000833 0.068890 0.076984 0.070387 0.055762 0.084346 0.098553 0.080438 0.079854 0.090619 0.175180 0.140708 0.134881
qa: 0.2964 -0.3238 -0.5585 -0.2268 -0.1110 -0.1048 -0.0143 -0.2734 0.5235 0.0065 -0.3696 -0.0008 0.0689 0.0770 0.0704 0.0558 0.0843 0.0986 0.0804 0.0799 0.0906 0.1752 0.1407 0.1349
va: 1.2169 2.0728 1.9424 3.2197 3.8967 3.9045 3.8401 3.9322 4.2800 3.9276 4.0550 3.8071 1.0111 1.0152 1.0061 1.0095 1.0282 1.0003 1.0003 0.9991 1.0043 1.0141 1.0009 0.9880
dispcorr: -0.007828879 hartree
energy: -815.089484591615
dipole: -275.37624 274.38199 -0.99425 -121.40272 121.64665 0.24393 -21.41581 22.55136 1.13554
magnitude: 1.52889 au
magnitude: 3.88613 debye
