program: Orca
programVersion: 5.0.2
elementType: I O O N C C C C C C C C H H H H H H H H H H H H
elementType: I
charge: 0
multiplicity: 1
keywords: wb97x-d3
keywords: def2-TZVPP
keywords: def2/J RIJCOSX
keywords: DEFGRID2
keywords: scfconv7
keywords: smallprint printgap noloewdin
keywords: NOSOSCF
formula: C8H12INO2
InChI: InChI=1/C8H12INO2/c1-2-3-6-10-8(11)12-7-4-5-9/h10H,2-3,6-7H2,1H3
24 atoms
I  2.94287 0.520809 0.074906
O  -2.298243 1.455511 -0.654621
O  -2.248103 0.247508 1.251005
N  -3.685161 -0.253499 -0.441149
C  -3.449203 -2.71925 -0.199829
C  -4.093443 -3.963393 0.39614
C  -4.233153 -1.460973 0.1409
C  -3.34854 -5.239244 0.036802
C  -2.7092 0.448136 0.142318
C  -1.329304 2.343617 -0.113917
C  -0.001506 1.748538 -0.04164
C  1.112253 1.293202 0.003632
H  -2.422332 -2.621621 0.165313
H  -3.388389 -2.822937 -1.287559
H  -5.128784 -4.035696 0.050167
H  -4.142951 -3.861223 1.484285
H  -4.296458 -1.334265 1.222149
H  -5.257865 -1.555487 -0.218785
H  -3.826202 -6.116662 0.474268
H  -3.316773 -5.387374 -1.044165
H  -2.318191 -5.212198 0.395482
H  -3.925165 -0.039376 -1.397402
H  -1.309202 3.195826 -0.792974
H  -1.633268 2.716437 0.867078
elementType: I O N C H
totalener: -815.08315274 hartree
nucrepener: 793.17137583 hartree
electener: -1608.25452858 hartree
oneelecener: -2796.37067981 hartree
twoeener: 1188.11615124 hartree
cpcmener: -0.03067269 hartree
kineticenergy: 628.60398253 hartree
xcener: -65.066749945044 hartree
chargesum: 0.0000000
charge: 0.295857 -0.323972 -0.561071 -0.232550 -0.101522 -0.090855 -0.026869 -0.275325 0.534463 0.002530 -0.370105 0.000188 0.067913 0.063559 0.057779 0.060955 0.087691 0.103087 0.090387 0.079123 0.079641 0.181705 0.134737 0.142655
qa: 0.2959 -0.3240 -0.5611 -0.2326 -0.1015 -0.0909 -0.0269 -0.2753 0.5345 0.0025 -0.3701 0.0002 0.0679 0.0636 0.0578 0.0610 0.0877 0.1031 0.0904 0.0791 0.0796 0.1817 0.1347 0.1427
va: 1.2162 2.0745 1.9338 3.2170 3.8512 3.8849 3.8580 3.9437 4.2650 3.9331 4.0426 3.8217 1.0193 1.0148 1.0078 1.0066 1.0176 1.0040 1.0039 1.0005 1.0008 1.0117 0.9885 0.9972
dispcorr: -0.007798544 hartree
energy: -815.090951286320
dipole: -253.99228 253.29351 -0.69877 -69.30291 69.17341 -0.12950 -1.76504 0.46725 -1.29779
magnitude: 1.47963 au
magnitude: 3.76091 debye
