program: Orca
programVersion: 5.0.2
elementType: I O O N C C C C C C C C H H H H H H H H H H H H
elementType: I
charge: 0
multiplicity: 1
keywords: wb97x-d3
keywords: def2-TZVPP
keywords: def2/J RIJCOSX
keywords: DEFGRID2
keywords: scfconv7
keywords: smallprint printgap noloewdin
keywords: NOSOSCF
formula: C8H12INO2
InChI: InChI=1/C8H12INO2/c1-2-3-6-10-8(11)12-7-4-5-9/h10H,2-3,6-7H2,1H3
24 atoms
I  2.664603 0.052236 -0.056625
O  -2.217855 2.056468 -0.609857
O  -2.216009 0.923365 1.337543
N  -3.636304 0.37387 -0.36149
C  -3.445775 -2.082487 -0.59999
C  -1.925474 -2.177345 -0.511811
C  -4.074556 -0.912019 0.147086
C  -1.400469 -2.515026 0.875898
C  -2.657697 1.083284 0.214767
C  -1.086963 2.794515 -0.162337
C  0.106442 1.959415 -0.113146
C  1.074762 1.243629 -0.105706
H  -3.745193 -2.02141 -1.650539
H  -3.893198 -3.002374 -0.211668
H  -1.466399 -1.248075 -0.863969
H  -1.592909 -2.947974 -1.211633
H  -3.858146 -0.957117 1.212592
H  -5.159504 -0.966611 0.051725
H  -0.311993 -2.588566 0.872629
H  -1.669349 -1.761796 1.616317
H  -1.793248 -3.47216 1.223776
H  -3.819998 0.553708 -1.338355
H  -0.955606 3.594231 -0.890841
H  -1.269746 3.261176 0.807934
elementType: I O N C H
totalener: -815.08150371 hartree
nucrepener: 850.16134500 hartree
electener: -1665.24284871 hartree
oneelecener: -2910.44563831 hartree
twoeener: 1245.20278959 hartree
cpcmener: -0.02955519 hartree
kineticenergy: 628.60188002 hartree
xcener: -65.067964539478 hartree
chargesum: -0.0000000
charge: 0.299771 -0.319598 -0.546266 -0.223410 -0.113502 -0.106971 -0.042684 -0.270228 0.505191 0.020081 -0.348453 -0.035148 0.079476 0.066754 0.052024 0.078551 0.098519 0.107258 0.088008 0.074333 0.084080 0.175774 0.135303 0.141138
qa: 0.2998 -0.3196 -0.5463 -0.2234 -0.1135 -0.1070 -0.0427 -0.2702 0.5052 0.0201 -0.3485 -0.0351 0.0795 0.0668 0.0520 0.0786 0.0985 0.1073 0.0880 0.0743 0.0841 0.1758 0.1353 0.1411
va: 1.2236 2.0683 1.9434 3.1985 3.8896 3.8803 3.8693 3.9184 4.3081 3.9063 4.0123 3.8537 1.0118 1.0169 1.0133 1.0077 1.0124 1.0040 1.0057 1.0123 1.0039 1.0131 0.9890 0.9982
dispcorr: -0.010451566 hartree
energy: -815.091955280373
dipole: -215.57014 215.12671 -0.44343 -5.73573 5.35736 -0.37837 2.87424 -4.31127 -1.43703
magnitude: 1.55076 au
magnitude: 3.94172 debye
