program: Orca
programVersion: 5.0.2
elementType: I O O N C C C C C C C C H H H H H H H H H H H H
elementType: I
charge: 0
multiplicity: 1
keywords: wb97x-d3
keywords: def2-TZVPP
keywords: def2/J RIJCOSX
keywords: DEFGRID2
keywords: scfconv7
keywords: smallprint printgap noloewdin
keywords: NOSOSCF
formula: C8H12INO2
InChI: InChI=1/C8H12INO2/c1-2-3-6-10-8(11)12-7-4-5-9/h10H,2-3,6-7H2,1H3
24 atoms
I  2.85194 0.354933 0.393778
O  -2.196081 1.442936 -0.995629
O  -2.469867 0.747129 1.132907
N  -3.616739 -0.20236 -0.584557
C  -3.434402 -2.426131 0.569584
C  -3.204271 -3.438875 -0.548362
C  -4.287721 -1.213811 0.207279
C  -2.431206 -2.929733 -1.757891
C  -2.742104 0.655392 -0.04762
C  -1.222127 2.378925 -0.557192
C  0.047949 1.73968 -0.23899
C  1.108531 1.221344 -0.002985
H  -3.940345 -2.938284 1.392883
H  -2.475364 -2.088907 0.973631
H  -4.169831 -3.836514 -0.876899
H  -2.663772 -4.288161 -0.121469
H  -4.663141 -0.746168 1.11857
H  -5.166046 -1.529419 -0.357861
H  -1.499347 -2.441136 -1.465682
H  -2.171979 -3.755564 -2.422574
H  -3.005031 -2.218107 -2.352576
H  -3.709134 -0.230345 -1.588005
H  -1.086847 3.069597 -1.390061
H  -1.57823 2.961996 0.295327
elementType: I O N C H
totalener: -815.08135057 hartree
nucrepener: 821.94818839 hartree
electener: -1637.02953896 hartree
oneelecener: -2853.77424614 hartree
twoeener: 1216.74470717 hartree
cpcmener: -0.02488442 hartree
kineticenergy: 628.60123575 hartree
xcener: -65.065843158558 hartree
chargesum: -0.0000000
charge: 0.290221 -0.320414 -0.527586 -0.226923 -0.124983 -0.096255 -0.050107 -0.274490 0.514084 0.002647 -0.357248 -0.005121 0.077022 0.071827 0.052900 0.067837 0.103892 0.103369 0.082589 0.093980 0.073349 0.177331 0.132590 0.139490
qa: 0.2902 -0.3204 -0.5276 -0.2269 -0.1250 -0.0963 -0.0501 -0.2745 0.5141 0.0026 -0.3572 -0.0051 0.0770 0.0718 0.0529 0.0678 0.1039 0.1034 0.0826 0.0940 0.0733 0.1773 0.1326 0.1395
va: 1.2186 2.0729 1.9780 3.1957 3.8539 3.8901 3.8741 3.9438 4.2944 3.9321 4.0392 3.8271 1.0130 1.0214 1.0079 1.0057 1.0131 1.0000 1.0020 1.0041 1.0017 1.0134 0.9879 0.9999
dispcorr: -0.009070339 hartree
energy: -815.090420913471
dipole: -239.58095 239.16325 -0.41770 -40.27870 39.76285 -0.51585 -33.07262 31.85383 -1.21879
magnitude: 1.38781 au
magnitude: 3.52753 debye
