program: Orca
programVersion: 5.0.2
elementType: I O O N C C C C C C C C H H H H H H H H H H H H
elementType: I
charge: 0
multiplicity: 1
keywords: wb97x-d3
keywords: def2-TZVPP
keywords: def2/J RIJCOSX
keywords: DEFGRID2
keywords: scfconv7
keywords: smallprint printgap noloewdin
keywords: NOSOSCF
formula: C8H12INO2
InChI: InChI=1/C8H12INO2/c1-2-3-6-10-8(11)12-7-4-5-9/h10H,2-3,6-7H2,1H3
24 atoms
I  3.201255 1.018977 0.245008
O  -2.058471 0.321826 -0.352536
O  -1.689167 -1.09955 1.359442
N  -2.611238 -1.799259 -0.60483
C  -4.444981 -3.387016 -0.127329
C  -5.143611 -2.528951 0.919039
C  -2.942642 -3.15423 -0.219939
C  -6.641163 -2.790375 0.979269
C  -2.093148 -0.892677 0.233418
C  -1.43184 1.366297 0.376796
C  0.020356 1.248569 0.345469
C  1.221673 1.18039 0.306626
H  -4.604746 -4.446121 0.096394
H  -4.898188 -3.213693 -1.109519
H  -4.974411 -1.470206 0.703288
H  -4.697168 -2.716409 1.900279
H  -2.506911 -3.841321 -0.948457
H  -2.465656 -3.367604 0.735639
H  -6.856416 -3.830442 1.232369
H  -7.125729 -2.163551 1.729263
H  -7.119316 -2.580984 0.019989
H  -2.947822 -1.47697 -1.500188
H  -1.740039 2.290385 -0.11375
H  -1.788432 1.409362 1.408217
elementType: I O N C H
totalener: -815.08417791 hartree
nucrepener: 796.45341968 hartree
electener: -1611.53759759 hartree
oneelecener: -2802.74002035 hartree
twoeener: 1191.20242276 hartree
cpcmener: -0.02464411 hartree
kineticenergy: 628.60465521 hartree
xcener: -65.066171280626 hartree
chargesum: 0.0000000
charge: 0.289359 -0.320527 -0.524591 -0.229054 -0.101506 -0.087355 -0.042551 -0.278801 0.508857 0.002564 -0.362451 0.002172 0.067237 0.065374 0.057704 0.063072 0.104072 0.096040 0.080367 0.090453 0.077776 0.171344 0.132403 0.138041
qa: 0.2894 -0.3205 -0.5246 -0.2291 -0.1015 -0.0874 -0.0426 -0.2788 0.5089 0.0026 -0.3625 0.0022 0.0672 0.0654 0.0577 0.0631 0.1041 0.0960 0.0804 0.0905 0.0778 0.1713 0.1324 0.1380
va: 1.2144 2.0715 1.9819 3.1843 3.8536 3.8603 3.8794 3.9467 4.3035 3.9393 4.0566 3.8082 1.0163 1.0117 1.0151 1.0081 1.0016 1.0229 1.0005 1.0032 1.0008 1.0164 0.9878 1.0013
dispcorr: -0.008272884 hartree
energy: -815.092450794672
dipole: -280.87751 280.23262 -0.64489 -106.83828 106.74934 -0.08894 2.84949 -4.07621 -1.22673
magnitude: 1.38876 au
magnitude: 3.52995 debye
