program: Gaussian 09
title: 000065875
version: EM64L-G09RevD.01
frameworkgroup: C1[X(C18H19N3O2)]
method: RPBEPBE
basis: SDD
operation: Freq
keyword: #p
keyword: freq=noraman
keyword: PBEPBE/SDD
title: #p freq=noraman PBEPBE/SDD
converged: YES YES NO NO
title: Mulliken charges:
elementType: O O N N N C C C C C C C C C C C C C C C C C C H H H H H H H H H H H H H H H H H H H
charge: -0.298453 -0.301140 -0.120275 -0.064208 -0.690516 0.403694 0.282884 -0.731079 -0.081684 -0.600785 -0.535287 0.183770 0.211443 0.193100 0.350552 -0.781910 -0.367603 -0.379598 -0.433708 -0.420666 0.492285 -0.529975 -0.529656 0.266174 0.235453 0.260727 0.292876 0.256375 0.227815 0.230865 0.246286 0.272685 0.215072 0.216507 0.229797 0.223709 0.258811 0.249929 0.231374 0.221311 0.307431 0.305617
chargesum: 0.00000
title: Mulliken charges with hydrogens summed into heavy atoms:
elementType: O O N N N C C C C C C C C C C C C C C C C C C
charge: -0.298453 -0.301140 -0.120275 -0.064208 -0.077467 0.403694 0.282884 -0.229451 -0.081684 -0.340057 -0.242411 0.183770 0.211443 0.193100 0.350552 -0.066855 -0.121317 -0.106913 -0.218637 -0.204159 0.492285 0.182342 0.172957
polarizability: 3.48227774e+02 3.69652029e+01 2.74216212e+02 1.21445689e+01 -9.66590108e+00 1.37621879e+02
1716.lowfreq: -5.1192 -0.0009 -0.0008 0.0004 5.1785 6.0834 39.3109 41.6450 56.7281
frequency: 39.3069 41.6361 56.7242 62.5334 85.0700 90.1222 111.1239 123.6221 140.7940 163.9944 169.9511 178.4477 190.2805 211.9471 222.2622 258.7954 266.5099 276.8339 303.8615 329.0898 344.5934 365.3265 373.0935 383.9837 387.7362 390.7996 414.1622 424.0227 457.5075 480.0486 492.4758 505.4990 533.0472 564.2100 577.7585 632.8443 643.3447 648.6882 689.5548 709.7760 713.4149 740.5884 747.8743 774.4507 814.3302 816.8284 819.1055 836.8039 887.9681 891.7967 910.1998 920.0187 928.6373 944.8985 952.4098 962.0442 973.1751 1000.9749 1017.5979 1031.8369 1045.7880 1080.7252 1114.5479 1116.0492 1123.7121 1132.1034 1148.5749 1150.9213 1168.9982 1171.7986 1188.8607 1234.6641 1253.6409 1260.1410 1285.0630 1308.3223 1312.6264 1331.4152 1356.3764 1371.6294 1379.1362 1388.2407 1424.6346 1425.9991 1441.7691 1448.2855 1456.1506 1457.7776 1459.3517 1460.3613 1460.5155 1477.7703 1482.2117 1488.7464 1517.5368 1544.7829 1567.8542 1570.1880 1611.6012 1628.8573 1642.6874 2968.4071 2968.7407 2975.6050 2982.9941 3041.7300 3063.4400 3073.9915 3081.5943 3111.8000 3115.9343 3119.4666 3119.8711 3124.3038 3146.7755 3147.7554 3159.7602 3164.5696 3563.7890 3704.2508
redmass: 4.4441 4.1511 3.7074 3.8887 4.2816 3.6241 2.9107 3.7622 3.7670 1.0834 1.0733 1.1649 4.0487 3.5005 4.6504 4.3729 6.1590 6.0019 5.1808 3.7691 3.9657 2.5579 1.5148 2.7229 3.6445 1.0470 2.9598 4.8790 4.6183 4.3501 5.2683 3.2674 4.8027 4.5054 4.2309 6.8222 6.8106 4.8935 5.8290 6.1900 5.6392 4.0227 3.9049 4.8797 2.5122 4.7164 1.6020 1.8242 3.8940 1.9442 2.0901 2.1214 1.8789 4.7330 1.4531 3.7632 1.3983 2.7028 1.4439 1.5220 2.0251 4.7918 1.2405 1.2431 1.7410 1.2384 1.4292 1.4434 1.9953 1.9843 1.1568 1.3050 1.5410 6.1099 2.4208 1.4587 2.4108 4.7510 7.0342 4.9069 4.4664 1.3580 1.3212 2.5020 1.6321 1.1388 1.6154 1.1196 1.2350 1.0562 1.3804 1.0615 3.2479 1.0526 3.1896 9.0893 5.6428 6.8564 7.0691 3.1191 1.4411 1.0310 1.0380 1.0311 1.0645 1.0967 1.1042 1.1033 1.0979 1.0978 1.0882 1.1021 1.0894 1.1033 1.0949 1.0918 1.0919 1.0946 1.0448 1.1040
irintensity: 1.6705 1.3444 0.1112 1.9739 0.9096 4.9618 9.5798 2.2427 1.8273 0.4613 0.1553 2.6991 2.6204 7.1280 1.1081 2.6832 1.8431 7.7909 2.0047 5.4641 0.2801 67.3024 234.4560 3.5980 3.9584 7.2546 0.3795 5.0056 2.3496 7.3542 5.7858 8.1146 28.4407 13.4201 12.5875 2.5757 7.2488 8.1404 4.6293 8.1426 0.2904 7.1839 5.9546 9.6376 11.6586 4.3675 6.4583 71.3485 17.5932 2.3889 35.6772 21.1072 3.0397 57.5107 10.5094 55.0789 3.4474 1.0802 0.6031 3.2571 9.8261 79.7324 21.4594 1.4564 16.4526 11.5887 9.3069 0.8236 35.4095 46.2411 62.9937 4.6904 7.0676 136.9881 41.1264 16.0006 21.2163 295.7537 5.3985 16.2190 5.6560 24.9459 3.0226 32.7203 9.9598 19.8940 26.0366 5.7685 9.5014 12.9092 6.8053 7.4233 135.3192 21.6951 69.4843 33.2579 13.5145 6.0033 25.4864 107.3855 426.2370 75.6991 29.6573 81.4280 21.1071 19.7783 28.3601 22.4992 19.4875 11.6997 16.4148 25.4795 39.5520 23.6023 15.0248 4.5755 1.1873 4.5245 126.4788 20.8285
temp: 298.150 k
press: 1.00000 atm
elementType: 8 8 7 7 7 6 6 6 6 6 6 6 6 6 6 6 6 6 6 6 6 6 6 1 1 1 1 1 1 1 1 1 1 1 1 1 1 1 1 1 1 1
symmnumber: 1
zpe: 874180.3 jmol-1
zpe.correction: 0.332958 hartree
zpe.thermalcorrener: 0.354779 hartree
zpe.thermalcorrenthalpy: 0.355724 hartree
zpe.thermalcorrgfe: 0.282700 hartree
zpe.sumelectzpe: -1010.300619 hartree
zpe.sumelectthermal: -1010.278797 hartree
zpe.sumelectthermalent: -1010.277853 hartree
zpe.sumelectthermalfe: -1010.350877 hartree
dipole: -0.0165 -3.8631 1.8586
dipole: 4.2870
quadrupole: -95.9652 -124.9256 -138.6900
quadrupole: 16.0238 -2.8715 1.1049
quadrupole: 23.8950 -5.0653 -18.8297 16.0238 -2.8715 1.1049
hfenergy: -1010.6335767 hartree
pointgroup: C01 [X(C18H19N3O2)]
dipole: -0.0779092 -1.5338913 0.6969941 debye
polarizability: 351.2673394|33.2679515|271.4409788|13.4537089|-7.0719743|137.3575461 unknown
InChI: InChI=1S/C18H19N3O2/c1-11-8-13-9-16(22-2)17(23-3)10-15(13)18(21-20-11)12-4-6-14(19)7-5-12/h4-7,9-10H,8,19H2,1-3H3
charge 0 multiplicity 1
42 atoms
O  4.150755 -1.623434 0.546612
O  1.989555 -2.882041 -0.979806
N  -0.980525 2.400717 -0.369868
N  0.124754 3.193098 -0.663128
N  -5.947132 -1.621147 0.202008
C  1.465921 0.950593 0.803559
C  0.409896 0.355539 0.037045
C  1.25537 2.344895 1.370867
C  -0.881521 1.079882 -0.138263
C  2.698875 0.272291 0.937394
C  0.618443 -0.930702 -0.530317
C  1.166595 3.258328 0.142924
C  2.90422 -0.990893 0.348249
C  1.837871 -1.611051 -0.371707
C  -2.171769 0.347885 -0.069604
C  2.30918 4.176737 -0.205396
C  -2.320694 -0.860244 0.66906
C  -3.329335 0.878133 -0.709085
C  -3.56222 -1.512296 0.766198
C  -4.572618 0.235589 -0.622655
C  -4.713695 -0.976871 0.118062
C  4.904056 -1.929802 -0.694095
C  2.150195 -3.998168 -0.019114
H  0.302562 2.400179 1.934627
H  2.080577 2.643977 2.036842
H  3.525861 0.718845 1.499682
H  -0.171767 -1.413629 -1.113178
H  2.110138 4.685418 -1.161731
H  3.255853 3.608151 -0.288583
H  2.459212 4.941264 0.58212
H  -1.457993 -1.281243 1.19681
H  -3.222116 1.810203 -1.272329
H  -3.650371 -2.435598 1.352363
H  -5.445167 0.661382 -1.133826
H  5.807902 -2.461722 -0.36068
H  5.185782 -0.989441 -1.20439
H  4.306223 -2.560661 -1.375312
H  3.02862 -3.837231 0.632432
H  2.287707 -4.899173 -0.636171
H  1.238583 -4.101656 0.599873
H  -6.768983 -1.231594 -0.250308
H  -6.049699 -2.48641 0.724022
